Repository 32bit  Forum
Repository 64bit  Wiki

Errore cross-compilazione ppp

Se avete problemi con l'installazione e la configurazione di Slackware postate qui. Non usate questo forum per argomenti generali... per quelli usate Gnu/Linux in genere.

Moderatore: Staff

Regole del forum
1) Citare sempre la versione di Slackware usata, la versione del Kernel e magari anche la versione della libreria coinvolta. Questi dati aiutano le persone che possono rispondere.
2) Per evitare confusione prego inserire in questo forum solo topic che riguardano appunto Slackware, se l'argomento è generale usate il forum Gnu/Linux in genere.
3) Leggere attentamente le risposte ricevute.
4) Scrivere i messaggi con il colore di default, evitare altri colori.
5) Scrivere in Italiano o in Inglese, se possibile grammaticalmente corretto, evitate stili di scrittura poco chiari, quindi nessuna abbreviazione tipo telegramma o scrittura stile SMS o CHAT.
6) Appena registrati è consigliato presentarsi nel forum dedicato.

La non osservanza delle regole porta a provvedimenti di vari tipo da parte dello staff, in particolare la non osservanza della regola 5 porta alla cancellazione del post e alla segnalazione dell'utente. In caso di recidività l'utente rischia il ban temporaneo.

Errore cross-compilazione ppp

Messaggioda litino » ven dic 02, 2011 21:46

Ciao,
sto cercando di installare ppp su di una mini2440 seguendo questa guida.
Ho ricompilato e reinstallato correttamente il kernel, vedo infatti il device /dev/ppp e vengono create correttamenti i vari /dev/ttyUSBx quando inserisco la usb-key.
Il problema è che non riesco a compilare ppp (la parte in user-space).
Questo è l'errore :
Codice: Seleziona tutto
options.c:59:18: error: pcap.h: No such file or directory
options.c: In function 'setpassfilter':
options.c:1465: error: 'pcap_t' undeclared (first use in this function)
options.c:1465: error: (Each undeclared identifier is reported only once
options.c:1465: error: for each function it appears in.)
options.c:1465: error: 'pc' undeclared (first use in this function)
options.c:1468: warning: implicit declaration of function 'pcap_open_dead'
options.c:1468: error: 'DLT_PPP' undeclared (first use in this function)
options.c:1469: warning: implicit declaration of function 'pcap_compile'
options.c:1471: warning: implicit declaration of function 'pcap_geterr'
options.c:1474: warning: implicit declaration of function 'pcap_close'
options.c: In function 'setactivefilter':
options.c:1486: error: 'pcap_t' undeclared (first use in this function)
options.c:1486: error: 'pc' undeclared (first use in this function)
options.c:1489: error: 'DLT_PPP' undeclared (first use in this function)
make[1]: *** [options.o] Error 1
make[1]: Leaving directory `/home/emanuele/mini2440/ppp_user_space/ppp-2.4.5/pppd'
make: *** [all] Error 2

In realtà pcap.h è nella directory /usr/include/. Ho provato anche a passare al configure l'opzione --prefix=/usr/include ma l'errore non cambia.
Googlando un pò, mi sembra di aver capito che manca libpcap-dev che però per slackware sembra non esistere (solo rpm e derivati).
Qualcuno mi da una mano?
Thanks
litino
Linux 1.0
Linux 1.0
 
Messaggi: 86
Iscritto il: lun nov 12, 2007 13:08
Slackware: 13.37
Kernel: 2.6.37.6
Desktop: KDE

Torna a Slackware

Chi c’è in linea

Visitano il forum: Nessuno e 2 ospiti