Pagina 4 di 6

Re: Splash Grafico su Slackware

Inviato: mar feb 19, 2008 0:14
da Dani
Di male in peggio .

Codice: Seleziona tutto

make -e -w -C libs/lrmi-0.10 liblrmi.a
make[1]: Entering directory `/home/tmp/v86d-build/v86d-0.1.3/libs/lrmi-0.10'
make[1]: warning: jobserver unavailable: using -j1.  Add `+' to parent make rule.
klcc -c  -g -Wall -o lrmi.o lrmi.c
klcc -Wall -g -O2 -I/lib/modules/2.6.24.2/source/include -Ilibs/lrmi-0.10 -c -o v86.o v86.c
In file included from /usr/lib/klibc/include/sys/types.h:15,
                 from /usr/lib/klibc/include/unistd.h:11,
                 from /usr/lib/klibc/include/stdio.h:11,
                 from lrmi.c:29:
/usr/lib/klibc/include/linux/posix_types.h:47:29: error: asm/posix_types.h: No such file or directory
In file included from /usr/lib/klibc/include/unistd.h:11,
                 from /usr/lib/klibc/include/stdio.h:11,
                 from lrmi.c:29:
/usr/lib/klibc/include/sys/types.h:16:23: error: asm/types.h: No such file or directory
In file included from /usr/lib/klibc/include/unistd.h:11,
                 from /usr/lib/klibc/include/stdio.h:11,
                 from lrmi.c:29:
/usr/lib/klibc/include/sys/types.h:23: error: expected '=', ',', ';', 'asm' or '__attribute__' before 'ino_t'
/usr/lib/klibc/include/sys/types.h:24: error: expected '=', ',', ';', 'asm' or '__attribute__' before 'mode_t'
/usr/lib/klibc/include/sys/types.h:25: error: expected '=', ',', ';', 'asm' or '__attribute__' before 'nlink_t'
/usr/lib/klibc/include/sys/types.h:26: error: expected '=', ',', ';', 'asm' or '__attribute__' before 'off_t'
/usr/lib/klibc/include/sys/types.h:27: error: expected '=', ',', ';', 'asm' or '__attribute__' before 'loff_t'
/usr/lib/klibc/include/sys/types.h:28: error: expected '=', ',', ';', 'asm' or '__attribute__' before 'pid_t'
/usr/lib/klibc/include/sys/types.h:29: error: expected '=', ',', ';', 'asm' or '__attribute__' before 'daddr_t'
/usr/lib/klibc/include/sys/types.h:31: error: expected '=', ',', ';', 'asm' or '__attribute__' before 'suseconds_t'
/usr/lib/klibc/include/sys/types.h:35: error: expected '=', ',', ';', 'asm' or '__attribute__' before 'uid_t'
/usr/lib/klibc/include/sys/types.h:36: error: expected '=', ',', ';', 'asm' or '__attribute__' before 'gid_t'
/usr/lib/klibc/include/sys/types.h:38: error: expected '=', ',', ';', 'asm' or '__attribute__' before 'fsid_t'
/usr/lib/klibc/include/sys/types.h:61: error: expected '=', ',', ';', 'asm' or '__attribute__' before 'time_t'
/usr/lib/klibc/include/sys/types.h:66: error: expected '=', ',', ';', 'asm' or '__attribute__' before 'clock_t'
/usr/lib/klibc/include/sys/types.h:71: error: expected '=', ',', ';', 'asm' or '__attribute__' before 'caddr_t'
In file included from /usr/lib/klibc/include/sys/time.h:11,
                 from /usr/lib/klibc/include/sys/select.h:9,
                 from /usr/lib/klibc/include/unistd.h:12,
                 from /usr/lib/klibc/include/stdio.h:11,
                 from lrmi.c:29:
/usr/lib/klibc/include/linux/time.h:14: error: expected specifier-qualifier-list before 'time_t'
/usr/lib/klibc/include/linux/time.h:20: error: expected specifier-qualifier-list before 'time_t'
In file included from /usr/lib/klibc/include/sys/select.h:11,
                 from /usr/lib/klibc/include/unistd.h:12,
                 from /usr/lib/klibc/include/stdio.h:11,
                 from lrmi.c:29:
/usr/lib/klibc/include/signal.h:98: error: expected ')' before 'int'
In file included from /usr/lib/klibc/include/stdio.h:11,
                 from lrmi.c:29:
/usr/lib/klibc/include/unistd.h:17: error: expected '=', ',', ';', 'asm' or '__attribute__' before 'fork'
/usr/lib/klibc/include/unistd.h:18: error: expected '=', ',', ';', 'asm' or '__attribute__' before 'vfork'
/usr/lib/klibc/include/unistd.h:19: error: expected '=', ',', ';', 'asm' or '__attribute__' before 'getpid'
/usr/lib/klibc/include/unistd.h:20: error: expected '=', ',', ';', 'asm' or '__attribute__' before 'getpgid'
/usr/lib/klibc/include/unistd.h:21: warning: parameter names (without types) in function declaration
/usr/lib/klibc/include/unistd.h:22: error: expected '=', ',', ';', 'asm' or '__attribute__' before 'getppid'
/usr/lib/klibc/include/unistd.h:23: error: expected '=', ',', ';', 'asm' or '__attribute__' before 'getpgrp'
/usr/lib/klibc/include/unistd.h:25: error: expected '=', ',', ';', 'asm' or '__attribute__' before 'setsid'
/usr/lib/klibc/include/unistd.h:26: error: expected '=', ',', ';', 'asm' or '__attribute__' before 'getsid'
/usr/lib/klibc/include/unistd.h:37: warning: parameter names (without types) in function declaration
/usr/lib/klibc/include/unistd.h:38: error: expected '=', ',', ';', 'asm' or '__attribute__' before 'getuid'
/usr/lib/klibc/include/unistd.h:39: warning: parameter names (without types) in function declaration
/usr/lib/klibc/include/unistd.h:40: error: expected '=', ',', ';', 'asm' or '__attribute__' before 'geteuid'
/usr/lib/klibc/include/unistd.h:41: warning: parameter names (without types) in function declaration
/usr/lib/klibc/include/unistd.h:42: error: expected '=', ',', ';', 'asm' or '__attribute__' before 'getgid'
/usr/lib/klibc/include/unistd.h:43: warning: parameter names (without types) in function declaration
/usr/lib/klibc/include/unistd.h:44: error: expected '=', ',', ';', 'asm' or '__attribute__' before 'getegid'
/usr/lib/klibc/include/unistd.h:45: error: expected declaration specifiers or '...' before 'gid_t'
/usr/lib/klibc/include/unistd.h:46: warning: type defaults to 'int' in declaration of 'gid_t'
/usr/lib/klibc/include/unistd.h:46: error: expected ';', ',' or ')' before '*' token
/usr/lib/klibc/include/unistd.h:47: warning: parameter names (without types) in function declaration
/usr/lib/klibc/include/unistd.h:48: warning: parameter names (without types) in function declaration
/usr/lib/klibc/include/unistd.h:49: warning: parameter names (without types) in function declaration
/usr/lib/klibc/include/unistd.h:50: warning: parameter names (without types) in function declaration
/usr/lib/klibc/include/unistd.h:51: warning: parameter names (without types) in function declaration
/usr/lib/klibc/include/unistd.h:52: warning: parameter names (without types) in function declaration
/usr/lib/klibc/include/unistd.h:68: error: expected declaration specifiers or '...' before 'mode_t'
/usr/lib/klibc/include/unistd.h:69: error: expected declaration specifiers or '...' before 'mode_t'
/usr/lib/klibc/include/unistd.h:70: error: expected declaration specifiers or '...' before 'mode_t'
/usr/lib/klibc/include/unistd.h:71: error: expected declaration specifiers or '...' before 'mode_t'
/usr/lib/klibc/include/unistd.h:72: error: expected declaration specifiers or '...' before 'mode_t'
/usr/lib/klibc/include/unistd.h:80: error: expected declaration specifiers or '...' before 'uid_t'
/usr/lib/klibc/include/unistd.h:80: error: expected declaration specifiers or '...' before 'gid_t'
/usr/lib/klibc/include/unistd.h:81: error: expected declaration specifiers or '...' before 'uid_t'
/usr/lib/klibc/include/unistd.h:81: error: expected declaration specifiers or '...' before 'gid_t'
/usr/lib/klibc/include/unistd.h:82: error: expected declaration specifiers or '...' before 'uid_t'
/usr/lib/klibc/include/unistd.h:82: error: expected declaration specifiers or '...' before 'gid_t'
/usr/lib/klibc/include/unistd.h:90: error: expected declaration specifiers or '...' before 'mode_t'
/usr/lib/klibc/include/unistd.h:91: error: expected declaration specifiers or '...' before 'mode_t'
/usr/lib/klibc/include/unistd.h:93: error: expected '=', ',', ';', 'asm' or '__attribute__' before 'lseek'
/usr/lib/klibc/include/unistd.h:95: error: expected '=', ',', ';', 'asm' or '__attribute__' before 'llseek'
/usr/lib/klibc/include/unistd.h:102: error: expected declaration specifiers or '...' before 'off_t'
/usr/lib/klibc/include/unistd.h:103: error: expected declaration specifiers or '...' before 'off_t'
/usr/lib/klibc/include/unistd.h:110: error: expected declaration specifiers or '...' before 'off_t'
/usr/lib/klibc/include/unistd.h:122: error: expected declaration specifiers or '...' before 'off_t'
/usr/lib/klibc/include/unistd.h:122: error: expected declaration specifiers or '...' before 'off_t'
In file included from lrmi.c:29:
/usr/lib/klibc/include/stdio.h:62: error: expected declaration specifiers or '...' before 'off_t'
/usr/lib/klibc/include/stdio.h: In function 'fseek':
/usr/lib/klibc/include/stdio.h:64: error: expected '=', ',', ';', 'asm' or '__attribute__' before 'lseek'
/usr/lib/klibc/include/stdio.h:64: warning: implicit declaration of function 'lseek'
/usr/lib/klibc/include/stdio.h:64: error: expected expression before 'int'
/usr/lib/klibc/include/stdio.h:65: error: '__o' undeclared (first use in this function)
/usr/lib/klibc/include/stdio.h:65: error: (Each undeclared identifier is reported only once
/usr/lib/klibc/include/stdio.h:65: error: for each function it appears in.)
/usr/lib/klibc/include/stdio.h:65: error: 'off_t' undeclared (first use in this function)
/usr/lib/klibc/include/stdio.h: At top level:
/usr/lib/klibc/include/stdio.h:67: error: expected '=', ',', ';', 'asm' or '__attribute__' before 'ftell'
lrmi.c:34:22: error: asm/vm86.h: No such file or directory
In file included from /usr/lib/klibc/include/klibc/stathelp.h:10,
                 from /usr/lib/klibc/include/arch/i386/klibc/archstat.h:4,
                 from /usr/lib/klibc/include/sys/stat.h:11,
                 from lrmi.c:57:
/usr/lib/klibc/include/klibc/endian.h:11:27: error: asm/byteorder.h: No such file or directory
/usr/lib/klibc/include/klibc/endian.h:36:3: error: #error "Unknown byte order!"
In file included from lrmi.c:57:
/usr/lib/klibc/include/sys/stat.h:70: error: expected '=', ',', ';', 'asm' or '__attribute__' before 'umask'
/usr/lib/klibc/include/sys/stat.h:71: error: expected declaration specifiers or '...' before 'mode_t'
/usr/lib/klibc/include/sys/stat.h:72: error: expected declaration specifiers or '...' before 'mode_t'
/usr/lib/klibc/include/sys/stat.h:73: error: expected declaration specifiers or '...' before 'mode_t'
/usr/lib/klibc/include/sys/stat.h: In function 'mkfifo':
/usr/lib/klibc/include/sys/stat.h:75: error: '__m' undeclared (first use in this function)
/usr/lib/klibc/include/sys/stat.h:75: error: too many arguments to function 'mknod'
In file included from lrmi.c:58:
/usr/lib/klibc/include/sys/mman.h:10:22: error: asm/mman.h: No such file or directory
In file included from lrmi.c:58:
/usr/lib/klibc/include/sys/mman.h: At top level:
/usr/lib/klibc/include/sys/mman.h:14: error: expected declaration specifiers or '...' before 'off_t'
/usr/lib/klibc/include/sys/mman.h:17: error: expected declaration specifiers or '...' before 'mode_t'
In file included from /usr/lib/klibc/include/fcntl.h:14,
                 from lrmi.c:60:
/usr/lib/klibc/include/linux/fcntl.h:4:23: error: asm/fcntl.h: No such file or directory
In file included from lrmi.c:60:
/usr/lib/klibc/include/fcntl.h:43: error: expected declaration specifiers or '...' before 'mode_t'
lrmi.c: In function 'read_file':
lrmi.c:84: error: 'O_RDONLY' undeclared (first use in this function)
lrmi.c: In function 'map_file':
lrmi.c:108: error: 'MAP_SHARED' undeclared (first use in this function)
lrmi.c:108: error: 'O_RDWR' undeclared (first use in this function)
lrmi.c:108: error: 'O_RDONLY' undeclared (first use in this function)
lrmi.c:115: error: too many arguments to function 'mmap'
lrmi.c: In function 'real_mem_init':
lrmi.c:134: error: 'PROT_READ' undeclared (first use in this function)
lrmi.c:134: error: 'PROT_WRITE' undeclared (first use in this function)
lrmi.c:134: error: 'PROT_EXEC' undeclared (first use in this function)
lrmi.c:135: error: 'MAP_FIXED' undeclared (first use in this function)
lrmi.c:135: error: 'MAP_PRIVATE' undeclared (first use in this function)
lrmi.c: At top level:
lrmi.c:267: error: field 'vm' has incomplete type
lrmi.c: In function 'LRMI_init':
lrmi.c:336: error: 'PROT_READ' undeclared (first use in this function)
lrmi.c:336: error: 'PROT_WRITE' undeclared (first use in this function)
lrmi.c:336: error: 'PROT_EXEC' undeclared (first use in this function)
lrmi.c:337: error: 'MAP_FIXED' undeclared (first use in this function)
lrmi.c:337: error: 'MAP_SHARED' undeclared (first use in this function)
lrmi.c: In function 'set_regs':
lrmi.c:399: error: 'IF_MASK' undeclared (first use in this function)
lrmi.c:399: error: 'IOPL_MASK' undeclared (first use in this function)
lrmi.c: In function 'em_inbl':
lrmi.c:545: error: invalid lvalue in asm output 0
lrmi.c: In function 'em_inb':
lrmi.c:553: error: invalid lvalue in asm output 0
lrmi.c: In function 'em_inw':
lrmi.c:561: error: invalid lvalue in asm output 0
lrmi.c: In function 'em_inl':
lrmi.c:569: error: invalid lvalue in asm output 0
lrmi.c: In function 'run_vm86':
lrmi.c:812: warning: implicit declaration of function 'VM86_TYPE'
lrmi.c:812: error: 'VM86_INTx' undeclared (first use in this function)
lrmi.c:813: warning: implicit declaration of function 'VM86_ARG'
lrmi.c:824: error: 'VIF_MASK' undeclared (first use in this function)
lrmi.c:824: error: 'TF_MASK' undeclared (first use in this function)
lrmi.c:829: error: 'VM86_UNKNOWN' undeclared (first use in this function)
lrmi.c: In function 'LRMI_int':
lrmi.c:1051: error: 'IF_MASK' undeclared (first use in this function)
lrmi.c:1051: error: 'IOPL_MASK' undeclared (first use in this function)
make[1]: *** [lrmi.o] Error 1
make[1]: Leaving directory `/home/tmp/v86d-build/v86d-0.1.3/libs/lrmi-0.10'
make: *** [lrmi] Error 2
make: *** Waiting for unfinished jobs....

Questo con klibc 1.5.8 :(

Re: Splash Grafico su Slackware

Inviato: mer feb 20, 2008 9:42
da nuitari
lol .
Hai fatto un bel clean prima vero? hai provato a rimuovere le directory e a ricrearle vuote?
Ora provo anch'io =)

Re: Splash Grafico su Slackware

Inviato: mer feb 20, 2008 10:00
da Dani
Si, ho riestratto tutto l'archivio e ripetuto la procedura...
Temo sia colpa delle vecchie klibc, quelle stabili. Le ho installate da make install e non sono certo su come disinstallare. Basta un rm -rf /usr/lib/klibc vero ? :roll:

[edit]
doh ! come non detto, sto guardando lo slackbuild su slacky e mi sa che devo eliminare altra roba.
Rifaccio tutto daccapo ...
[edit]
Niente da fare :(

Re: Splash Grafico su Slackware

Inviato: mer feb 20, 2008 10:39
da nuitari
Cosa singifica niente da fare? :)
Che versione di klibc hai installato?

Re: Splash Grafico su Slackware

Inviato: mer feb 20, 2008 11:15
da Dani
nuitari ha scritto:Cosa singifica niente da fare? :)
Che versione di klibc hai installato?


La 1.5.8, ma il make di v86d continua a darmi tutti quegli errori che ho postato su...

Re: Splash Grafico su Slackware

Inviato: ven feb 29, 2008 15:37
da Dani
Risolto linkando asm-x86 a asm-i386, tra i sorgenti del kernel. Così facendo sia klibc che v86d si sono compilati senza problemi !

Re: Splash Grafico su Slackware

Inviato: dom mar 16, 2008 11:48
da nuitari
grazie per la segnalazione e per la soluzione del problema :-)

Ho aggiornato la wiki

Re: Splash Grafico su Slackware

Inviato: sab set 20, 2008 16:47
da lennynero
Nuitari anche io ero interessato al tuo howto, solo che giunto al capitolo "Installazione di splashutils e miscsplashutils" mi sono bloccato perche i link ai 2 pacchetti sono persi e non riesco a compilarmeli da me: posto l'output del mio tentativo di compilare splashutils

Codice: Seleziona tutto

Making all in libs
  CONF    libjpeg.a
  MAKE    libjpeg.a
In file included from /usr/lib/klibc/include/sys/types.h:15,
                 from /usr/lib/klibc/include/unistd.h:11,
                 from /usr/lib/klibc/include/stdio.h:11,
                 from /tmp/pkgs/splashutils-pkg/splashutils-1.5.4.2/libs/jpeg-6b/jinclude.h:46,
                 from /tmp/pkgs/splashutils-pkg/splashutils-1.5.4.2/libs/jpeg-6b/jcapimin.c:20:
/usr/lib/klibc/include/linux/posix_types.h:47:29: error: asm/posix_types.h: No such file or directory
In file included from /usr/lib/klibc/include/unistd.h:11,
                 from /usr/lib/klibc/include/stdio.h:11,
                 from /tmp/pkgs/splashutils-pkg/splashutils-1.5.4.2/libs/jpeg-6b/jinclude.h:46,
                 from /tmp/pkgs/splashutils-pkg/splashutils-1.5.4.2/libs/jpeg-6b/jcapimin.c:20:
/usr/lib/klibc/include/sys/types.h:16:23: error: asm/types.h: No such file or directory
In file included from /usr/lib/klibc/include/unistd.h:11,
                 from /usr/lib/klibc/include/stdio.h:11,
                 from /tmp/pkgs/splashutils-pkg/splashutils-1.5.4.2/libs/jpeg-6b/jinclude.h:46,
                 from /tmp/pkgs/splashutils-pkg/splashutils-1.5.4.2/libs/jpeg-6b/jcapimin.c:20:
/usr/lib/klibc/include/sys/types.h:23: error: expected '=', ',', ';', 'asm' or '__attribute__' before 'ino_t'
/usr/lib/klibc/include/sys/types.h:24: error: expected '=', ',', ';', 'asm' or '__attribute__' before 'mode_t'
/usr/lib/klibc/include/sys/types.h:25: error: expected '=', ',', ';', 'asm' or '__attribute__' before 'nlink_t'
/usr/lib/klibc/include/sys/types.h:26: error: expected '=', ',', ';', 'asm' or '__attribute__' before 'off_t'
/usr/lib/klibc/include/sys/types.h:27: error: expected '=', ',', ';', 'asm' or '__attribute__' before 'loff_t'
/usr/lib/klibc/include/sys/types.h:28: error: expected '=', ',', ';', 'asm' or '__attribute__' before 'pid_t'
/usr/lib/klibc/include/sys/types.h:29: error: expected '=', ',', ';', 'asm' or '__attribute__' before 'daddr_t'
/usr/lib/klibc/include/sys/types.h:31: error: expected '=', ',', ';', 'asm' or '__attribute__' before 'suseconds_t'
/usr/lib/klibc/include/sys/types.h:35: error: expected '=', ',', ';', 'asm' or '__attribute__' before 'uid_t'
/usr/lib/klibc/include/sys/types.h:36: error: expected '=', ',', ';', 'asm' or '__attribute__' before 'gid_t'
/usr/lib/klibc/include/sys/types.h:38: error: expected '=', ',', ';', 'asm' or '__attribute__' before 'fsid_t'
/usr/lib/klibc/include/sys/types.h:61: error: expected '=', ',', ';', 'asm' or '__attribute__' before 'time_t'
/usr/lib/klibc/include/sys/types.h:66: error: expected '=', ',', ';', 'asm' or '__attribute__' before 'clock_t'
/usr/lib/klibc/include/sys/types.h:71: error: expected '=', ',', ';', 'asm' or '__attribute__' before 'caddr_t'
In file included from /usr/lib/klibc/include/sys/time.h:11,
                 from /usr/lib/klibc/include/sys/select.h:9,
                 from /usr/lib/klibc/include/unistd.h:12,
                 from /usr/lib/klibc/include/stdio.h:11,
                 from /tmp/pkgs/splashutils-pkg/splashutils-1.5.4.2/libs/jpeg-6b/jinclude.h:46,
                 from /tmp/pkgs/splashutils-pkg/splashutils-1.5.4.2/libs/jpeg-6b/jcapimin.c:20:
/usr/lib/klibc/include/linux/time.h:15: error: expected specifier-qualifier-list before 'time_t'
/usr/lib/klibc/include/linux/time.h:21: error: expected specifier-qualifier-list before 'time_t'
In file included from /usr/lib/klibc/include/sys/select.h:11,
                 from /usr/lib/klibc/include/unistd.h:12,
                 from /usr/lib/klibc/include/stdio.h:11,
                 from /tmp/pkgs/splashutils-pkg/splashutils-1.5.4.2/libs/jpeg-6b/jinclude.h:46,
                 from /tmp/pkgs/splashutils-pkg/splashutils-1.5.4.2/libs/jpeg-6b/jcapimin.c:20:
/usr/lib/klibc/include/signal.h:98: error: expected ')' before 'int'
In file included from /usr/lib/klibc/include/stdio.h:11,
                 from /tmp/pkgs/splashutils-pkg/splashutils-1.5.4.2/libs/jpeg-6b/jinclude.h:46,
                 from /tmp/pkgs/splashutils-pkg/splashutils-1.5.4.2/libs/jpeg-6b/jcapimin.c:20:
/usr/lib/klibc/include/unistd.h:17: error: expected '=', ',', ';', 'asm' or '__attribute__' before 'fork'
/usr/lib/klibc/include/unistd.h:18: error: expected '=', ',', ';', 'asm' or '__attribute__' before 'vfork'
/usr/lib/klibc/include/unistd.h:19: error: expected '=', ',', ';', 'asm' or '__attribute__' before 'getpid'
/usr/lib/klibc/include/unistd.h:20: error: expected '=', ',', ';', 'asm' or '__attribute__' before 'getpgid'
/usr/lib/klibc/include/unistd.h:22: error: expected '=', ',', ';', 'asm' or '__attribute__' before 'getppid'
/usr/lib/klibc/include/unistd.h:23: error: expected '=', ',', ';', 'asm' or '__attribute__' before 'getpgrp'
/usr/lib/klibc/include/unistd.h:25: error: expected '=', ',', ';', 'asm' or '__attribute__' before 'setsid'
/usr/lib/klibc/include/unistd.h:26: error: expected '=', ',', ';', 'asm' or '__attribute__' before 'getsid'
/usr/lib/klibc/include/unistd.h:37: error: expected '=', ',', ';', 'asm' or '__attribute__' before 'getuid'
/usr/lib/klibc/include/unistd.h:39: error: expected '=', ',', ';', 'asm' or '__attribute__' before 'geteuid'
/usr/lib/klibc/include/unistd.h:41: error: expected '=', ',', ';', 'asm' or '__attribute__' before 'getgid'
/usr/lib/klibc/include/unistd.h:43: error: expected '=', ',', ';', 'asm' or '__attribute__' before 'getegid'
/usr/lib/klibc/include/unistd.h:44: error: expected declaration specifiers or '...' before 'gid_t'
/usr/lib/klibc/include/unistd.h:45: error: expected ';', ',' or ')' before '*' token
/usr/lib/klibc/include/unistd.h:67: error: expected declaration specifiers or '...' before 'mode_t'
/usr/lib/klibc/include/unistd.h:68: error: expected declaration specifiers or '...' before 'mode_t'
/usr/lib/klibc/include/unistd.h:69: error: expected declaration specifiers or '...' before 'mode_t'
/usr/lib/klibc/include/unistd.h:70: error: expected declaration specifiers or '...' before 'mode_t'
/usr/lib/klibc/include/unistd.h:71: error: expected declaration specifiers or '...' before 'mode_t'
/usr/lib/klibc/include/unistd.h:79: error: expected declaration specifiers or '...' before 'uid_t'
/usr/lib/klibc/include/unistd.h:79: error: expected declaration specifiers or '...' before 'gid_t'
/usr/lib/klibc/include/unistd.h:80: error: expected declaration specifiers or '...' before 'uid_t'
/usr/lib/klibc/include/unistd.h:80: error: expected declaration specifiers or '...' before 'gid_t'
/usr/lib/klibc/include/unistd.h:81: error: expected declaration specifiers or '...' before 'uid_t'
/usr/lib/klibc/include/unistd.h:81: error: expected declaration specifiers or '...' before 'gid_t'
/usr/lib/klibc/include/unistd.h:89: error: expected declaration specifiers or '...' before 'mode_t'
/usr/lib/klibc/include/unistd.h:90: error: expected declaration specifiers or '...' before 'mode_t'
/usr/lib/klibc/include/unistd.h:92: error: expected '=', ',', ';', 'asm' or '__attribute__' before 'lseek'
/usr/lib/klibc/include/unistd.h:94: error: expected '=', ',', ';', 'asm' or '__attribute__' before 'llseek'
/usr/lib/klibc/include/unistd.h:101: error: expected declaration specifiers or '...' before 'off_t'
/usr/lib/klibc/include/unistd.h:102: error: expected declaration specifiers or '...' before 'off_t'
/usr/lib/klibc/include/unistd.h:109: error: expected declaration specifiers or '...' before 'off_t'
/usr/lib/klibc/include/unistd.h:121: error: expected declaration specifiers or '...' before 'off_t'
/usr/lib/klibc/include/unistd.h:121: error: expected declaration specifiers or '...' before 'off_t'
In file included from /tmp/pkgs/splashutils-pkg/splashutils-1.5.4.2/libs/jpeg-6b/jinclude.h:46,
                 from /tmp/pkgs/splashutils-pkg/splashutils-1.5.4.2/libs/jpeg-6b/jcapimin.c:20:
/usr/lib/klibc/include/stdio.h:62: error: expected declaration specifiers or '...' before 'off_t'
/usr/lib/klibc/include/stdio.h: In function 'fseek':
/usr/lib/klibc/include/stdio.h:64: error: expected '=', ',', ';', 'asm' or '__attribute__' before 'lseek'
/usr/lib/klibc/include/stdio.h:64: error: expected expression before 'int'
/usr/lib/klibc/include/stdio.h:65: error: '__o' undeclared (first use in this function)
/usr/lib/klibc/include/stdio.h:65: error: (Each undeclared identifier is reported only once
/usr/lib/klibc/include/stdio.h:65: error: for each function it appears in.)
/usr/lib/klibc/include/stdio.h:65: error: 'off_t' undeclared (first use in this function)
/usr/lib/klibc/include/stdio.h: At top level:
/usr/lib/klibc/include/stdio.h:67: error: expected '=', ',', ';', 'asm' or '__attribute__' before 'ftell'
make[3]: *** [jcapimin.o] Error 1
make[2]: *** [libjpeg.a] Error 2
make[1]: *** [all-recursive] Error 1
make: *** [all] Error 2

Questo dopo aver ricompilato(apparentemente senza problemi) klibc..., qualche idea?

Re: Splash Grafico su Slackware

Inviato: lun set 22, 2008 22:02
da nuitari
eh lol e chi si ricorda cos'era ^^ hai guardato le faq sulla compilazione? comunque riuppo i pacchetti appena ho un secondo di tempo, giurin giuretta

Re: Splash Grafico su Slackware

Inviato: mar set 23, 2008 19:04
da Blizzard
Offtopic: oh nuitari!!
che fine hai fatto? :D
non è che zitto zitto sei ripassato a windows?? :p :lol: :lol:


Gio

Re: Splash Grafico su Slackware

Inviato: mer set 24, 2008 8:15
da nuitari
lol mai nella vita :P
Ho solo una vitaccia ultimamente, tutto li

Re: Splash Grafico su Slackware

Inviato: mer set 24, 2008 17:30
da Blizzard
nuitari ha scritto:lol mai nella vita :P
Ho solo una vitaccia ultimamente, tutto li

Uh! capito!
comunque quando puoi... we're here :thumbright:

Gio

Re: Splash Grafico su Slackware

Inviato: mer ott 01, 2008 21:51
da lennynero
Sono riuscito a compilare splashutils e anche(pare) miscsplashutils, il tema insideslack non lo trovo, ne ho usato uno di gentoo x prova solo che non mi funziona la modalità verbose...posto l'output:

Codice: Seleziona tutto

 # splash_manager -t livecd-2007.0 -c demo -m v
Failed to open the fbcon_decor control device.
Failed to open the fbcon_decor control device.
Failed to open the fbcon_decor control device.
Failed to open the fbcon_decor control device.

Failed to open the fbcon_decor control device.

Googlando non ho trovato riscontri..., mi date una mano?

EDIT: aggiungo che splashutils riesco a compilarlo solo con --disable-helper...., e per adesso ho provato con il kernel 2.6.25.6 e la patch 2.6.25rc6(non so se ho fatto bene), inoltre tengo a precisare che ho una ati x700 e non sono mai riuscito ad usare radeonfb, malgrado abbia seguito pedissequamente la guida...

Re: Splash Grafico su Slackware

Inviato: gio ott 02, 2008 14:40
da lennynero
sto provando a risolvere il problema del --disable-helper, ho risolto il problema relativo a klib, solo che ora freetype mi da problemi:

Codice: Seleziona tutto

  CONF    libfreetype.a
configure: error: cannot compute sizeof (int)
See `config.log' for more details.
make[3]: *** [setup] Error 77
  MAKE    libfreetype.a
/bin/sh: /tmp/pkgs/splashutils-pkg/splashutils-1.5.4.2/libs/libfreetype/libtool: No such file or directory
make[3]: *** [/tmp/pkgs/splashutils-pkg/splashutils-1.5.4.2/libs/libfreetype/ftsystem.lo] Error 127
make[2]: *** [libfreetype.a] Error 2
make[1]: *** [all-recursive] Error 1
make: *** [all] Error 2

Tengo a precisare che mi sono ricompilato freetype e glib2 staticamente, ma niente...

Re: Splash Grafico su Slackware

Inviato: lun ott 06, 2008 9:42
da nuitari
non ho matematicamente avuto il tempo di guardare, in ogni caso ho cominciato con il riuppare le vecchie versioni dei pacchetti. Inizia a provare queste (che comunque io uso a tutt'oggi)

http://www.noveanelli.com/splashutils-1 ... i686-2.tgz
http://www.noveanelli.com/miscsplashuti ... i686-1.tgz

ed il tema:

http://www.noveanelli.com/fbsplash.them ... arch-1.tgz