Repository 32bit  Forum
Repository 64bit  Wiki

programma karaoke [risolto]

Postate qui se avete consigli per migliorare i pacchetti disponibili in questo sito o se avete problemi con installazione, funzionamento o altro.

Moderatore: Staff

Regole del forum
1) Citare in modo preciso il nome del pacchetto.
2) Specificare se discussione/suggerimento o richiesta d'aiuto.
3) Leggere attentamente le risposte ricevute
4) Scrivere i messaggi con il colore di default, evitare altri colori.
5) Scrivere in Italiano o in Inglese, se possibile grammaticalmente corretto, evitate stili di scrittura poco chiari, quindi nessuna abbreviazione tipo telegramma o scrittura stile SMS o CHAT.
6) Appena registrati è consigliato presentarsi nel forum dedicato.

La non osservanza delle regole porta a provvedimenti di vari tipo da parte dello staff, in particolare la non osservanza della regola 5 porta alla cancellazione del post e alla segnalazione dell'utente. In caso di recidività l'utente rischia il ban temporaneo.

Re: programma karaoke

Messaggioda michele.p » gio feb 18, 2010 11:06

Si blocca al 10% ...a me lo supera e compila correttamente la sezione dove a te da errore (ho una Slack 13 - 32bit);
Codice: Seleziona tutto
bash-3.1$ make
Scanning dependencies of target plugin++
[  1%] Building CXX object libs/plugin++/CMakeFiles/plugin++.dir/src/dll.cc.o
[  3%] Building CXX object libs/plugin++/CMakeFiles/plugin++.dir/src/execname.cc.o
[  4%] Building CXX object libs/plugin++/CMakeFiles/plugin++.dir/src/loader.cc.o
Linking CXX static library libplugin++.a
[  4%] Built target plugin++
Scanning dependencies of target da
[  6%] Building CXX object libs/libda/src/CMakeFiles/da.dir/audio.cpp.o
Linking CXX static library libda.a
[  6%] Built target da
Scanning dependencies of target da_audio_dev_alsa
[  7%] Building CXX object libs/libda/plugins/CMakeFiles/da_audio_dev_alsa.dir/audio_dev_alsa.cpp.o
Linking CXX shared module libda_audio_dev_alsa.so
[  7%] Built target da_audio_dev_alsa
Scanning dependencies of target da_audio_dev_jack
[  9%] Building CXX object libs/libda/plugins/CMakeFiles/da_audio_dev_jack.dir/audio_dev_jack.cpp.o
Linking CXX shared module libda_audio_dev_jack.so
[  9%] Built target da_audio_dev_jack
Scanning dependencies of target da_audio_dev_tone
[ 10%] Building CXX object libs/libda/plugins/CMakeFiles/da_audio_dev_tone.dir/audio_dev_tone.cpp.o
Linking CXX shared module libda_audio_dev_tone.so
[ 10%] Built target da_audio_dev_tone
Scanning dependencies of target performous
[ 12%] Building CXX object game/CMakeFiles/performous.dir/screen_hiscore.cc.o
............
............

Le dipendenze sono tutte verificate? ...che versione di Slackware hai? ...32 o 64?

...eventualmente prova ad utilizzare la versione SVN... :)

POST EDIT; a me il problema lo da più in la, al 75% >:-(
Codice: Seleziona tutto
[ 74%] Building CXX object game/CMakeFiles/performous.dir/video.cc.o
[ 75%] Building CXX object game/CMakeFiles/performous.dir/configuration.cc.o
Linking CXX executable performous
CMakeFiles/performous.dir/surface.cc.o: In function `void loadJPEG<Surface>(Surface&, std::basic_string<char, std::char_traits<char>, std::allocator<char> > const&)':
surface.cc:(.text._Z8loadJPEGI7SurfaceEvRT_RKSs[void loadJPEG<Surface>(Surface&, std::basic_string<char, std::char_traits<char>, std::allocator<char> > const&)]+0x4d): undefined reference to `jpeg_std_error(jpeg_error_mgr*)'
surface.cc:(.text._Z8loadJPEGI7SurfaceEvRT_RKSs[void loadJPEG<Surface>(Surface&, std::basic_string<char, std::char_traits<char>, std::allocator<char> > const&)]+0x8a): undefined reference to `jpeg_CreateDecompress(jpeg_decompress_struct*, int, unsigned int)'
surface.cc:(.text._Z8loadJPEGI7SurfaceEvRT_RKSs[void loadJPEG<Surface>(Surface&, std::basic_string<char, std::char_traits<char>, std::allocator<char> > const&)]+0x9f): undefined reference to `jpeg_stdio_src(jpeg_decompress_struct*, _IO_FILE*)'
surface.cc:(.text._Z8loadJPEGI7SurfaceEvRT_RKSs[void loadJPEG<Surface>(Surface&, std::basic_string<char, std::char_traits<char>, std::allocator<char> > const&)]+0xaf): undefined reference to `jpeg_read_header(jpeg_decompress_struct*, int)'
surface.cc:(.text._Z8loadJPEGI7SurfaceEvRT_RKSs[void loadJPEG<Surface>(Surface&, std::basic_string<char, std::char_traits<char>, std::allocator<char> > const&)]+0x11b): undefined reference to `jpeg_destroy_decompress(jpeg_decompress_struct*)'
surface.cc:(.text._Z8loadJPEGI7SurfaceEvRT_RKSs[void loadJPEG<Surface>(Surface&, std::basic_string<char, std::char_traits<char>, std::allocator<char> > const&)]+0x1db): undefined reference to `jpeg_start_decompress(jpeg_decompress_struct*)'
surface.cc:(.text._Z8loadJPEGI7SurfaceEvRT_RKSs[void loadJPEG<Surface>(Surface&, std::basic_string<char, std::char_traits<char>, std::allocator<char> > const&)]+0x266): undefined reference to `jpeg_read_scanlines(jpeg_decompress_struct*, unsigned char**, unsigned int)'
surface.cc:(.text._Z8loadJPEGI7SurfaceEvRT_RKSs[void loadJPEG<Surface>(Surface&, std::basic_string<char, std::char_traits<char>, std::allocator<char> > const&)]+0x289): undefined reference to `jpeg_destroy_decompress(jpeg_decompress_struct*)'
CMakeFiles/performous.dir/surface.cc.o: In function `void loadJPEG<Texture>(Texture&, std::basic_string<char, std::char_traits<char>, std::allocator<char> > const&)':
surface.cc:(.text._Z8loadJPEGI7TextureEvRT_RKSs[void loadJPEG<Texture>(Texture&, std::basic_string<char, std::char_traits<char>, std::allocator<char> > const&)]+0x4d): undefined reference to `jpeg_std_error(jpeg_error_mgr*)'
surface.cc:(.text._Z8loadJPEGI7TextureEvRT_RKSs[void loadJPEG<Texture>(Texture&, std::basic_string<char, std::char_traits<char>, std::allocator<char> > const&)]+0x8a): undefined reference to `jpeg_CreateDecompress(jpeg_decompress_struct*, int, unsigned int)'
surface.cc:(.text._Z8loadJPEGI7TextureEvRT_RKSs[void loadJPEG<Texture>(Texture&, std::basic_string<char, std::char_traits<char>, std::allocator<char> > const&)]+0x9f): undefined reference to `jpeg_stdio_src(jpeg_decompress_struct*, _IO_FILE*)'
surface.cc:(.text._Z8loadJPEGI7TextureEvRT_RKSs[void loadJPEG<Texture>(Texture&, std::basic_string<char, std::char_traits<char>, std::allocator<char> > const&)]+0xaf): undefined reference to `jpeg_read_header(jpeg_decompress_struct*, int)'
surface.cc:(.text._Z8loadJPEGI7TextureEvRT_RKSs[void loadJPEG<Texture>(Texture&, std::basic_string<char, std::char_traits<char>, std::allocator<char> > const&)]+0x11b): undefined reference to `jpeg_destroy_decompress(jpeg_decompress_struct*)'
surface.cc:(.text._Z8loadJPEGI7TextureEvRT_RKSs[void loadJPEG<Texture>(Texture&, std::basic_string<char, std::char_traits<char>, std::allocator<char> > const&)]+0x1db): undefined reference to `jpeg_start_decompress(jpeg_decompress_struct*)'
surface.cc:(.text._Z8loadJPEGI7TextureEvRT_RKSs[void loadJPEG<Texture>(Texture&, std::basic_string<char, std::char_traits<char>, std::allocator<char> > const&)]+0x266): undefined reference to `jpeg_read_scanlines(jpeg_decompress_struct*, unsigned char**, unsigned int)'
surface.cc:(.text._Z8loadJPEGI7TextureEvRT_RKSs[void loadJPEG<Texture>(Texture&, std::basic_string<char, std::char_traits<char>, std::allocator<char> > const&)]+0x289): undefined reference to `jpeg_destroy_decompress(jpeg_decompress_struct*)'
collect2: ld returned 1 exit status
make[2]: *** [game/performous] Error 1
make[1]: *** [game/CMakeFiles/performous.dir/all] Error 2
make: *** [all] Error 2


Bye 8)
Avatar utente
michele.p
Packager
Packager
 
Messaggi: 1275
Iscritto il: ven nov 24, 2006 16:52
Località: Pontecorvo(FR)
Nome Cognome: Michele Petrecca
Slackware: 13.37
Kernel: 2.6.37.6
Desktop: KDE
Distribuzione: ..Fedora e Mandriva

Re: programma karaoke

Messaggioda sya54M » gio feb 18, 2010 11:38

io l'ho provato su una current a 32bit, ma anche se a te da errore al 75% invece che al 10%, se ci fai caso è lo stesso errore su surface.cc
Avatar utente
sya54M
Linux 3.x
Linux 3.x
 
Messaggi: 1429
Iscritto il: mer giu 06, 2007 13:44
Località: (Salerno)
Nome Cognome: Andrea P.
Slackware: 64-current
Kernel: 3.14.x
Desktop: KDE 4.13

Re: programma karaoke

Messaggioda michele.p » gio feb 18, 2010 12:10

...si potrebbe provare la versione presente nell'SVN allora... :-k ...anzi nel GIT -> http://performous.git.sourceforge.net/g ... ;a=summary

Bye 8)
Avatar utente
michele.p
Packager
Packager
 
Messaggi: 1275
Iscritto il: ven nov 24, 2006 16:52
Località: Pontecorvo(FR)
Nome Cognome: Michele Petrecca
Slackware: 13.37
Kernel: 2.6.37.6
Desktop: KDE
Distribuzione: ..Fedora e Mandriva

Re: programma karaoke

Messaggioda sya54M » gio feb 18, 2010 13:14

siccome ho un abbonamento a volume non vorrei scaricarlo per niente, ti posso chiedere di provarlo prima tu e dirmi se funziona? [-o<
Avatar utente
sya54M
Linux 3.x
Linux 3.x
 
Messaggi: 1429
Iscritto il: mer giu 06, 2007 13:44
Località: (Salerno)
Nome Cognome: Andrea P.
Slackware: 64-current
Kernel: 3.14.x
Desktop: KDE 4.13

Re: programma karaoke

Messaggioda michele.p » gio feb 18, 2010 14:28

abbonamento a volume?! :? ...si vede proprio che stiamo in Italia; questi pusillanimi delle TLC non sanno come fare soldi e si inventano le peggiori stronzate.... :? ....ora lo scarico con il GIT e vedo se da qualche problema.

Bye 8)
Avatar utente
michele.p
Packager
Packager
 
Messaggi: 1275
Iscritto il: ven nov 24, 2006 16:52
Località: Pontecorvo(FR)
Nome Cognome: Michele Petrecca
Slackware: 13.37
Kernel: 2.6.37.6
Desktop: KDE
Distribuzione: ..Fedora e Mandriva

Re: programma karaoke

Messaggioda sya54M » gio feb 18, 2010 14:49

è perchè non ho una linea telefonica fissa, allora uso un abbonamento a traffico limitato con la 3 collegandomi col cellulare.

grazie mille :)
Avatar utente
sya54M
Linux 3.x
Linux 3.x
 
Messaggi: 1429
Iscritto il: mer giu 06, 2007 13:44
Località: (Salerno)
Nome Cognome: Andrea P.
Slackware: 64-current
Kernel: 3.14.x
Desktop: KDE 4.13

Re: programma karaoke

Messaggioda michele.p » gio feb 18, 2010 15:07

Allora, il problema rimane (a me da sempre lo stesso errore al 75%) >:-(

...durante il lancio di "cmake .." (prima del make tanto per intenderci), la configurazione è la seguente;

Codice: Seleziona tutto
bash-3.1$ cmake ..   
-- The CXX compiler identification is GNU
-- The C compiler identification is GNU 
-- Check for working CXX compiler: /usr/bin/c++
-- Check for working CXX compiler: /usr/bin/c++ -- works
-- Detecting CXX compiler ABI info                     
-- Detecting CXX compiler ABI info - done               
-- Check for working C compiler: /usr/bin/gcc           
-- Check for working C compiler: /usr/bin/gcc -- works 
-- Detecting C compiler ABI info                       
-- Detecting C compiler ABI info - done                 
-- Detected unix-i686. Use make package to build packages (TBZ2).
WARNING: CMAKE_BUILD_TYPE is not defined!                       
         Defaulting to CMAKE_BUILD_TYPE=RelWithDebInfo. Use ccmake to set a proper value.
-- checking for module 'Gettext'                                                         
--   package 'Gettext' not found                                                         
-- Found Gettext                                                                         
-- Found msgfmt to convert language file. Translation enabled                           
-- GCC detected, adding compile flags                                                   
-- Found DL                                                                             
-- Boost_INCLUDE_DIRS: /usr/include                                                     
-- Boost_LIBRARIES: /usr/lib/libboost_filesystem-mt.so;/usr/lib/libboost_system-mt.so   
-- GCC detected, adding compile flags                                                   
-- Boost_INCLUDE_DIRS: /usr/include                                                     
-- Boost_LIBRARIES: /usr/lib/libboost_thread-mt.so;/usr/lib/libboost_date_time-mt.so;optimized;/usr/lib/libboost_system-mt.so;debug;/usr/lib/libboost_system-mt.so;/usr/lib/libboost_filesystem-mt.so;optimized;/usr/lib/libboost_system-mt.so;debug;/usr/lib/libboost_system-mt.so                                                                                     
-- checking for module 'alsa'                                                                                                                                                       
--   found alsa, version 1.0.18                                                                                                                                                     
-- Found ALSA 1.0.18                                                                                                                                                               
-- checking for module 'jack'                                                                                                                                                       
--   found jack, version 0.116.2                                                                                                                                                   
-- Found Jack                                                                                                                                                                       
------------------------------------------------------------------                                                                                                                 
                       LibDA build summary                                                                                                                                         
------------------------------------------------------------------                                                                                                                 
 ALSA      : enabled                                                                                                                                                               
 Portaudio : disabled                                                                                                                                                               
 PulseAudio: disabled                                                                                                                                                               
 GStreamer : disabled                                                                                                                                                               
 JACK      : enabled                                                                                                                                                               
 Testing   : enabled                                                                                                                                                               
------------------------------------------------------------------                                                                                                                 
-- Boost_INCLUDE_DIRS: /usr/include                                                                                                                                                 
-- Boost_LIBRARIES: /usr/lib/libboost_thread-mt.so;/usr/lib/libboost_date_time-mt.so;/usr/lib/libboost_program_options-mt.so;/usr/lib/libboost_regex-mt.so;/usr/lib/libboost_filesystem-mt.so;/usr/lib/libboost_system-mt.so                                                                                                                                           
-- checking for module 'sdl'                                                                                                                                                       
--   found sdl, version 1.2.13                                                                                                                                                     
-- Found SDL                                                                                                                                                                       
-- checking for module 'freetype2'                                                                                                                                                 
--   found freetype2, version 9.20.3                                                                                                                                               
-- checking for module 'glib-2.0'                                                                                                                                                   
--   found glib-2.0, version 2.18.4                                                                                                                                                 
-- checking for module 'gobject-2.0'                                                                                                                                               
--   found gobject-2.0, version 2.18.4                                                                                                                                             
-- checking for module 'pango'                                                                                                                                                     
--   found pango, version 1.22.4                                                                                                                                                   
-- checking for module 'cairo'                                                                                                                                                     
--   found cairo, version 1.8.8                                                                                                                                                     
-- checking for module 'pangocairo'                                                                                                                                                 
--   found pangocairo, version 1.22.4                                                                                                                                               
-- Found PangoCairo                                                                                                                                                                 
-- checking for module 'gdk-pixbuf-2.0'                                                                                                                                             
--   found gdk-pixbuf-2.0, version 2.14.7                                                                                                                                           
-- checking for module 'librsvg-2.0'                                                                                                                                               
--   found librsvg-2.0, version 2.26.0                                                                                                                                             
-- Found LibRSVG                                                                                                                                                                   
-- checking for module 'libxml-2.0'                                                                                                                                                 
--   found libxml-2.0, version 2.7.3                                                                                                                                               
-- checking for module 'sigc++-2.0'                                                                                                                                                 
--   found sigc++-2.0, version 2.2.4                                                                                                                                               
-- checking for module 'glibmm-2.4'                                                                                                                                                 
--   found glibmm-2.4, version 2.18.2                                                                                                                                               
-- checking for module 'libxml++-2.6'                                                                                                                                               
--   found libxml++-2.6, version 2.26.1                                                                                                                                             
-- Found LibXML++                                                                                                                                                                   
-- checking for module 'gl'                                                                                                                                                         
--   found gl, version 7.5.0
-- Found GLEW
-- checking for module 'libavutil'
--   found libavutil, version 49.15.0
-- checking for module 'libavcodec'
--   found libavcodec, version 52.20.0
-- checking for module 'libavformat'
--   found libavformat, version 52.31.0
-- Found AVFormat
-- checking for module 'libswscale'
--   found libswscale, version 0.7.1
-- Found SWScale
-- Found OpenGL
-- checking for module 'Z'
--   package 'Z' not found
-- Found Z
-- checking for module 'jpeg'
--   package 'jpeg' not found
-- Found Jpeg
-- checking for module 'Png'
--   package 'Png' not found
-- Found Png
-- checking for module 'Gettext'
--   package 'Gettext' not found
-- Internationalization: Enabled
-- MIDI I/O: Disabled (libportmidi not found)
-- GCC detected, adding compile flags
WARNING: One of the following is missing: help2man, gzip; performous man page will not be generated
-- Boost_INCLUDE_DIRS: /usr/include
-- Boost_LIBRARIES: /usr/lib/libboost_filesystem-mt.so;/usr/lib/libboost_program_options-mt.so;/usr/lib/libboost_system-mt.so
-- Found LibXML++
-- checking for module 'ImageMagick'
--   found ImageMagick, version 6.5.3
-- checking for module 'ImageMagick++'
--   found ImageMagick++, version 6.5.3
-- Found Magick++
-- checking for module 'Z'
--   package 'Z' not found
-- Found Z
-- checking for module 'jpeg'
--   package 'jpeg' not found
-- Found Jpeg
-- checking for module 'tiff'
--   package 'tiff' not found
-- Found Tiff
-- checking for module 'Png'
--   package 'Png' not found
-- Found Png
-- Found Freetype
-- checking for module 'Z'
--   package 'Z' not found
-- GCC detected, enabling warnings
-- Configuring done
-- Generating done
-- Build files have been written to: /home/micha/Temp/performous/build
bash-3.1$


...le righe con "not found" non vorrei che fossero determinanti per la compilazione del programma. In serata provo la compilazione su Mandriva 2010.0

Bye 8)
Avatar utente
michele.p
Packager
Packager
 
Messaggi: 1275
Iscritto il: ven nov 24, 2006 16:52
Località: Pontecorvo(FR)
Nome Cognome: Michele Petrecca
Slackware: 13.37
Kernel: 2.6.37.6
Desktop: KDE
Distribuzione: ..Fedora e Mandriva

Re: programma karaoke

Messaggioda sya54M » ven feb 19, 2010 13:34

grazie di aver provato al posto mio facendomi risparmiare qualche MB.
ne proverò un altro...
Avatar utente
sya54M
Linux 3.x
Linux 3.x
 
Messaggi: 1429
Iscritto il: mer giu 06, 2007 13:44
Località: (Salerno)
Nome Cognome: Andrea P.
Slackware: 64-current
Kernel: 3.14.x
Desktop: KDE 4.13

Re: programma karaoke

Messaggioda michele.p » sab feb 20, 2010 15:51

Alla fine, sebbene fosse presente un pacchetto precompilato, ho provato anche su Mandriva 2010.0, ma questo è stato il risultato;

Codice: Seleziona tutto
micha@localhost build]$ make                                                                                                 
Scanning dependencies of target plugin++                                                                                     
[  1%] Building CXX object libs/plugin++/CMakeFiles/plugin++.dir/src/dll.cc.o                                                 
[  3%] Building CXX object libs/plugin++/CMakeFiles/plugin++.dir/src/execname.cc.o                                           
[  5%] Building CXX object libs/plugin++/CMakeFiles/plugin++.dir/src/loader.cc.o                                             
Linking CXX static library libplugin++.a                                                                                     
[  5%] Built target plugin++                                                                                                 
Scanning dependencies of target da                                                                                           
[  6%] Building CXX object libs/libda/src/CMakeFiles/da.dir/audio.cpp.o                                                       
Linking CXX static library libda.a                                                                                           
[  6%] Built target da                                                                                                       
Scanning dependencies of target da_audio_dev_alsa                                                                             
[  8%] Building CXX object libs/libda/plugins/CMakeFiles/da_audio_dev_alsa.dir/audio_dev_alsa.cpp.o                           
Linking CXX shared module libda_audio_dev_alsa.so                                                                             
[  8%] Built target da_audio_dev_alsa                                                                                         
Scanning dependencies of target da_audio_dev_jack                                                                             
[ 10%] Building CXX object libs/libda/plugins/CMakeFiles/da_audio_dev_jack.dir/audio_dev_jack.cpp.o                           
Linking CXX shared module libda_audio_dev_jack.so                                                                             
[ 10%] Built target da_audio_dev_jack                                                                                         
Scanning dependencies of target da_audio_dev_tone                                                                             
[ 11%] Building CXX object libs/libda/plugins/CMakeFiles/da_audio_dev_tone.dir/audio_dev_tone.cpp.o                           
Linking CXX shared module libda_audio_dev_tone.so                                                                             
[ 11%] Built target da_audio_dev_tone                                                                                         
Scanning dependencies of target performous                                                                                   
[ 13%] Building CXX object game/CMakeFiles/performous.dir/screen_hiscore.cc.o                                                 
[ 15%] Building CXX object game/CMakeFiles/performous.dir/configuration.cc.o                                                 
[ 16%] Building CXX object game/CMakeFiles/performous.dir/hiscore.cc.o                                                       
[ 18%] Building CXX object game/CMakeFiles/performous.dir/theme.cc.o                                                         
[ 20%] Building CXX object game/CMakeFiles/performous.dir/midifile.cc.o                                                       
[ 22%] Building CXX object game/CMakeFiles/performous.dir/progressbar.cc.o                                                   
[ 23%] Building CXX object game/CMakeFiles/performous.dir/notegraph.cc.o                                                     
[ 25%] Building CXX object game/CMakeFiles/performous.dir/ffmpeg.cc.o                                                         
[ 27%] Building CXX object game/CMakeFiles/performous.dir/engine.cc.o                                                         
[ 28%] Building CXX object game/CMakeFiles/performous.dir/fs.cc.o                                                             
[ 30%] Building CXX object game/CMakeFiles/performous.dir/main.cc.o                                                           
[ 32%] Building CXX object game/CMakeFiles/performous.dir/song.cc.o                                                           
[ 33%] Building CXX object game/CMakeFiles/performous.dir/backgrounds.cc.o                                                   
[ 35%] Building CXX object game/CMakeFiles/performous.dir/pitch.cc.o                                                         
[ 37%] Building CXX object game/CMakeFiles/performous.dir/screen_songs.cc.o                                                   
[ 38%] Building CXX object game/CMakeFiles/performous.dir/opengl_text.cc.o                                                   
[ 40%] Building CXX object game/CMakeFiles/performous.dir/unicode.cc.o                                                       
[ 42%] Building CXX object game/CMakeFiles/performous.dir/screen_sing.cc.o                                                   
[ 44%] Building CXX object game/CMakeFiles/performous.dir/surface.cc.o                                                       
[ 45%] Building CXX object game/CMakeFiles/performous.dir/video_driver.cc.o                                                   
In file included from /usr/include/SDL/SDL_stdinc.h:28,                                                                       
                 from /usr/include/SDL/SDL_events.h:28,                                                                       
                 from /home/micha/Giochi/Performous-0.5.1-Source/game/joystick.hh:8,                                         
                 from /home/micha/Giochi/Performous-0.5.1-Source/game/video_driver.cc:8:                                     
/usr/include/SDL/SDL_config.h:67:1: warning: "HAVE_STDLIB_H" redefined                                                       
In file included from /usr/include/jpeglib.h:28,                                                                             
                 from /home/micha/Giochi/Performous-0.5.1-Source/game/image.hh:6,                                             
                 from /home/micha/Giochi/Performous-0.5.1-Source/game/video_driver.cc:6:                                     
/usr/include/jconfig.h:12:1: warning: this is the location of the previous definition                                         
In file included from /home/micha/Giochi/Performous-0.5.1-Source/game/video_driver.cc:6:                                     
/usr/lib/gcc/i586-manbo-linux-gnu/4.4.1/../../../../include/c++/4.4.1/bits/stl_vector.h: In function ‘void writePNG(const std ::string&, const Image&)’:                                                                                                   
/usr/lib/gcc/i586-manbo-linux-gnu/4.4.1/../../../../include/c++/4.4.1/bits/stl_vector.h:1035: warning: variable ‘__first’ mig ht be clobbered by ‘longjmp’ or ‘vfork’                                                                                       
[ 47%] Building CXX object game/CMakeFiles/performous.dir/songitems.cc.o                                                     
[ 49%] Building CXX object game/CMakeFiles/performous.dir/songparser-ini.cc.o                                                 
[ 50%] Building CXX object game/CMakeFiles/performous.dir/players.cc.o                                                       
[ 52%] Building CXX object game/CMakeFiles/performous.dir/screen_intro.cc.o                                                   
[ 54%] Building CXX object game/CMakeFiles/performous.dir/screen_practice.cc.o                                               
[ 55%] Building CXX object game/CMakeFiles/performous.dir/songs.cc.o                                                         
[ 57%] Building CXX object game/CMakeFiles/performous.dir/menu.cc.o                                                           
[ 59%] Building CXX object game/CMakeFiles/performous.dir/notes.cc.o                                                         
[ 61%] Building CXX object game/CMakeFiles/performous.dir/screen_configuration.cc.o                                           
[ 62%] Building CXX object game/CMakeFiles/performous.dir/screenmanager.cc.o                                                 
[ 64%] Building CXX object game/CMakeFiles/performous.dir/color.cc.o                                                         
[ 66%] Building CXX object game/CMakeFiles/performous.dir/video.cc.o                                                         
[ 67%] Building CXX object game/CMakeFiles/performous.dir/songparser-txt.cc.o                                                 
[ 69%] Building CXX object game/CMakeFiles/performous.dir/layout_singer.cc.o                                                 
[ 71%] Building CXX object game/CMakeFiles/performous.dir/joystick.cc.o                                                       
[ 72%] Building CXX object game/CMakeFiles/performous.dir/guitargraph.cc.o                                                   
[ 74%] Building CXX object game/CMakeFiles/performous.dir/3dobject.cc.o                                                       
[ 76%] Building CXX object game/CMakeFiles/performous.dir/player.cc.o                                                         
[ 77%] Building CXX object game/CMakeFiles/performous.dir/dancegraph.cc.o                                                     
[ 79%] Building CXX object game/CMakeFiles/performous.dir/audio.cc.o                                                         
[ 81%] Building CXX object game/CMakeFiles/performous.dir/screen_players.cc.o                                                 
[ 83%] Building CXX object game/CMakeFiles/performous.dir/songparser-sm.cc.o                                                 
[ 84%] Building CXX object game/CMakeFiles/performous.dir/database.cc.o                                                       
Linking CXX executable performous                                                                                             
/usr/lib/gcc/i586-manbo-linux-gnu/4.4.1/../../../libportmidi.so: undefined reference to `snd_seq_port_subscribe_sizeof'       
/usr/lib/gcc/i586-manbo-linux-gnu/4.4.1/../../../libportmidi.so: undefined reference to `snd_seq_drain_output'               
/usr/lib/gcc/i586-manbo-linux-gnu/4.4.1/../../../libportmidi.so: undefined reference to `snd_seq_create_port'                 
/usr/lib/gcc/i586-manbo-linux-gnu/4.4.1/../../../libportmidi.so: undefined reference to `snd_seq_event_input_pending'         
/usr/lib/gcc/i586-manbo-linux-gnu/4.4.1/../../../libportmidi.so: undefined reference to `snd_seq_subscribe_port'             
/usr/lib/gcc/i586-manbo-linux-gnu/4.4.1/../../../libportmidi.so: undefined reference to `snd_seq_query_next_client'           
/usr/lib/gcc/i586-manbo-linux-gnu/4.4.1/../../../libportmidi.so: undefined reference to `snd_midi_event_new'                 
/usr/lib/gcc/i586-manbo-linux-gnu/4.4.1/../../../libportmidi.so: undefined reference to `snd_seq_event_input'                 
/usr/lib/gcc/i586-manbo-linux-gnu/4.4.1/../../../libportmidi.so: undefined reference to `snd_seq_queue_status_get_tick_time' 
/usr/lib/gcc/i586-manbo-linux-gnu/4.4.1/../../../libportmidi.so: undefined reference to `snd_seq_port_info_get_capability'   
/usr/lib/gcc/i586-manbo-linux-gnu/4.4.1/../../../libportmidi.so: undefined reference to `snd_midi_event_free'
/usr/lib/gcc/i586-manbo-linux-gnu/4.4.1/../../../libportmidi.so: undefined reference to `snd_seq_port_info_get_client'
/usr/lib/gcc/i586-manbo-linux-gnu/4.4.1/../../../libportmidi.so: undefined reference to `snd_seq_queue_tempo_set_ppq'
/usr/lib/gcc/i586-manbo-linux-gnu/4.4.1/../../../libportmidi.so: undefined reference to `snd_seq_queue_tempo_set_tempo'
/usr/lib/gcc/i586-manbo-linux-gnu/4.4.1/../../../libportmidi.so: undefined reference to `snd_seq_client_info_get_client'
/usr/lib/gcc/i586-manbo-linux-gnu/4.4.1/../../../libportmidi.so: undefined reference to `snd_seq_client_id'
/usr/lib/gcc/i586-manbo-linux-gnu/4.4.1/../../../libportmidi.so: undefined reference to `snd_seq_connect_to'
/usr/lib/gcc/i586-manbo-linux-gnu/4.4.1/../../../libportmidi.so: undefined reference to `snd_seq_disconnect_to'
/usr/lib/gcc/i586-manbo-linux-gnu/4.4.1/../../../libportmidi.so: undefined reference to `snd_seq_queue_tempo_sizeof'
/usr/lib/gcc/i586-manbo-linux-gnu/4.4.1/../../../libportmidi.so: undefined reference to `snd_seq_port_info_set_capability'
/usr/lib/gcc/i586-manbo-linux-gnu/4.4.1/../../../libportmidi.so: undefined reference to `snd_seq_port_subscribe_set_time_real'
/usr/lib/gcc/i586-manbo-linux-gnu/4.4.1/../../../libportmidi.so: undefined reference to `snd_seq_close'
/usr/lib/gcc/i586-manbo-linux-gnu/4.4.1/../../../libportmidi.so: undefined reference to `snd_seq_port_info_set_port_specified'
/usr/lib/gcc/i586-manbo-linux-gnu/4.4.1/../../../libportmidi.so: undefined reference to `snd_seq_free_queue'
/usr/lib/gcc/i586-manbo-linux-gnu/4.4.1/../../../libportmidi.so: undefined reference to `snd_seq_port_info_get_port'
/usr/lib/gcc/i586-manbo-linux-gnu/4.4.1/../../../libportmidi.so: undefined reference to `snd_seq_control_queue'
/usr/lib/gcc/i586-manbo-linux-gnu/4.4.1/../../../libportmidi.so: undefined reference to `snd_seq_port_info_sizeof'
/usr/lib/gcc/i586-manbo-linux-gnu/4.4.1/../../../libportmidi.so: undefined reference to `snd_seq_port_info_set_client'
/usr/lib/gcc/i586-manbo-linux-gnu/4.4.1/../../../libportmidi.so: undefined reference to `snd_midi_event_encode_byte'
/usr/lib/gcc/i586-manbo-linux-gnu/4.4.1/../../../libportmidi.so: undefined reference to `snd_seq_client_info_sizeof'
/usr/lib/gcc/i586-manbo-linux-gnu/4.4.1/../../../libportmidi.so: undefined reference to `snd_seq_get_queue_status'
/usr/lib/gcc/i586-manbo-linux-gnu/4.4.1/../../../libportmidi.so: undefined reference to `snd_seq_open'
/usr/lib/gcc/i586-manbo-linux-gnu/4.4.1/../../../libportmidi.so: undefined reference to `snd_seq_disconnect_from'
/usr/lib/gcc/i586-manbo-linux-gnu/4.4.1/../../../libportmidi.so: undefined reference to `snd_seq_port_info_get_name'
/usr/lib/gcc/i586-manbo-linux-gnu/4.4.1/../../../libportmidi.so: undefined reference to `snd_seq_port_info_set_type'
/usr/lib/gcc/i586-manbo-linux-gnu/4.4.1/../../../libportmidi.so: undefined reference to `snd_seq_alloc_queue'
/usr/lib/gcc/i586-manbo-linux-gnu/4.4.1/../../../libportmidi.so: undefined reference to `snd_seq_query_next_port'
/usr/lib/gcc/i586-manbo-linux-gnu/4.4.1/../../../libportmidi.so: undefined reference to `snd_seq_client_info_set_client'
/usr/lib/gcc/i586-manbo-linux-gnu/4.4.1/../../../libportmidi.so: undefined reference to `snd_seq_port_info_set_port'
/usr/lib/gcc/i586-manbo-linux-gnu/4.4.1/../../../libportmidi.so: undefined reference to `snd_seq_queue_status_sizeof'
/usr/lib/gcc/i586-manbo-linux-gnu/4.4.1/../../../libportmidi.so: undefined reference to `snd_seq_event_output'
/usr/lib/gcc/i586-manbo-linux-gnu/4.4.1/../../../libportmidi.so: undefined reference to `snd_seq_port_subscribe_set_time_update'
/usr/lib/gcc/i586-manbo-linux-gnu/4.4.1/../../../libportmidi.so: undefined reference to `snd_seq_port_subscribe_set_sender'
/usr/lib/gcc/i586-manbo-linux-gnu/4.4.1/../../../libportmidi.so: undefined reference to `snd_seq_port_subscribe_set_dest'
/usr/lib/gcc/i586-manbo-linux-gnu/4.4.1/../../../libportmidi.so: undefined reference to `snd_seq_set_queue_tempo'
/usr/lib/gcc/i586-manbo-linux-gnu/4.4.1/../../../libportmidi.so: undefined reference to `snd_seq_delete_port'
/usr/lib/gcc/i586-manbo-linux-gnu/4.4.1/../../../libportmidi.so: undefined reference to `snd_strerror'
collect2: ld returned 1 exit status
make[2]: *** [game/performous] Error 1
make[1]: *** [game/CMakeFiles/performous.dir/all] Error 2
make: *** [all] Error 2
[micha@localhost build]$


C'è un errore differente rispetto alla Slackware .... :-k

Bye 8)
Avatar utente
michele.p
Packager
Packager
 
Messaggi: 1275
Iscritto il: ven nov 24, 2006 16:52
Località: Pontecorvo(FR)
Nome Cognome: Michele Petrecca
Slackware: 13.37
Kernel: 2.6.37.6
Desktop: KDE
Distribuzione: ..Fedora e Mandriva

Re: programma karaoke [risolto]

Messaggioda sya54M » lun mar 29, 2010 19:40

facendo un'altra ricerca ho trovato questo, proprio nelle faq di pykaraoke:
Codice: Seleziona tutto
Slackware users may find that the MIDI player cannot find the timidity configuration files. You can fix this by creating a link from the PyKaraoke installation directory:

    # cd pykaraoke_install_dir
    # ln -s /usr/share/timidity/timidity.cfg .
    # ln -s /usr/share/timidity/instruments .

e ha funzionato anche con solo i gus-patches installati, quindi mi sono rifatto il txz in modo che crei da solo i link all'installazione.
funziona benissimo, grazie mille a tutti dei sugerimenti :thumbright:
Avatar utente
sya54M
Linux 3.x
Linux 3.x
 
Messaggi: 1429
Iscritto il: mer giu 06, 2007 13:44
Località: (Salerno)
Nome Cognome: Andrea P.
Slackware: 64-current
Kernel: 3.14.x
Desktop: KDE 4.13

Re: programma karaoke [risolto]

Messaggioda michele.p » lun mar 29, 2010 20:39

Nel frattempo hanno rilasciato una nuova versione di Performous ...vedi mai che hanno risolto quel problema di compilazione. :doubt:

Bye 8)
Avatar utente
michele.p
Packager
Packager
 
Messaggi: 1275
Iscritto il: ven nov 24, 2006 16:52
Località: Pontecorvo(FR)
Nome Cognome: Michele Petrecca
Slackware: 13.37
Kernel: 2.6.37.6
Desktop: KDE
Distribuzione: ..Fedora e Mandriva

Re: programma karaoke [risolto]

Messaggioda sya54M » lun mar 29, 2010 21:53

questa sera mi hanno detto che ci sono dei programmi per karaoke che cantando nel microfono dovrebbero dire se si sta cantando bene o male... :?
Performous è uno di questi?
Avatar utente
sya54M
Linux 3.x
Linux 3.x
 
Messaggi: 1429
Iscritto il: mer giu 06, 2007 13:44
Località: (Salerno)
Nome Cognome: Andrea P.
Slackware: 64-current
Kernel: 3.14.x
Desktop: KDE 4.13

Re: programma karaoke [risolto]

Messaggioda michele.p » lun mar 29, 2010 22:20

...se ben ricordo si, insieme a Ultrastar Deluxe; al termine della prova appare il voto in funzione del tempo e delle note "azzeccate". :D

Qui alcuni screenshot -> http://performous.org/screenshots.html e per Ultrastar Deluxe -> http://ultrastardx.sourceforge.net/abou ... ar-deluxe/

Bye 8)
Avatar utente
michele.p
Packager
Packager
 
Messaggi: 1275
Iscritto il: ven nov 24, 2006 16:52
Località: Pontecorvo(FR)
Nome Cognome: Michele Petrecca
Slackware: 13.37
Kernel: 2.6.37.6
Desktop: KDE
Distribuzione: ..Fedora e Mandriva

Re: programma karaoke [risolto]

Messaggioda sya54M » lun mar 29, 2010 22:28

:D
ok, allora (visto che questa funzionalità è interessante) proverò a compilare la nuova versione e farò sapere
grazie
Avatar utente
sya54M
Linux 3.x
Linux 3.x
 
Messaggi: 1429
Iscritto il: mer giu 06, 2007 13:44
Località: (Salerno)
Nome Cognome: Andrea P.
Slackware: 64-current
Kernel: 3.14.x
Desktop: KDE 4.13

Re: programma karaoke [risolto]

Messaggioda sya54M » sab giu 05, 2010 15:26

ho riprovato a compilare performous col sistema aggiornato alla 13.1 e ffmpeg di alien invece di quello di slacky, e si è compilato a dovere, ho installato il txz ed è partito... :D
ora però mi chiedo dove cerca le canzoni? supporta i file midi????
non sono riuscito ad usarlo
Avatar utente
sya54M
Linux 3.x
Linux 3.x
 
Messaggi: 1429
Iscritto il: mer giu 06, 2007 13:44
Località: (Salerno)
Nome Cognome: Andrea P.
Slackware: 64-current
Kernel: 3.14.x
Desktop: KDE 4.13

Precedente

Torna a Packages

Chi c’è in linea

Visitano il forum: Nessuno e 3 ospiti