Repository 32bit  Forum
Repository 64bit  Wiki

Elightenment e17 builder - Segnalazioni

Postate qui se avete consigli per migliorare i pacchetti disponibili in questo sito o se avete problemi con installazione, funzionamento o altro.

Moderatore: Staff

Regole del forum
1) Citare in modo preciso il nome del pacchetto.
2) Specificare se discussione/suggerimento o richiesta d'aiuto.
3) Leggere attentamente le risposte ricevute
4) Scrivere i messaggi con il colore di default, evitare altri colori.
5) Scrivere in Italiano o in Inglese, se possibile grammaticalmente corretto, evitate stili di scrittura poco chiari, quindi nessuna abbreviazione tipo telegramma o scrittura stile SMS o CHAT.
6) Appena registrati è consigliato presentarsi nel forum dedicato.

La non osservanza delle regole porta a provvedimenti di vari tipo da parte dello staff, in particolare la non osservanza della regola 5 porta alla cancellazione del post e alla segnalazione dell'utente. In caso di recidività l'utente rischia il ban temporaneo.

Re: Elightenment e17 builder is now ready!

Messaggioda joe » ven giu 25, 2010 7:16

erio ha scritto:l'ho messo su una slax e' propio piacevole,ho aggiunto tutte le librerie che servivano...forse qualche in piu' il comportamento tra kde3 e 4 e' diverso su slax la barra con le icone e' mobile,mi devo documentare..


Sto usando slax-6.1.2, tu su quale versione lo hai messo?
Sapresti dirmi quali paccheti/moduli hai installato/attivato?
Avatar utente
joe
Master
Master
 
Messaggi: 1958
Iscritto il: ven apr 27, 2007 10:21
Slackware: 14.0
Kernel: 3.2.29-smp
Desktop: KDE-4.8.5

Re: Elightenment e17 builder - Segnalazioni

Messaggioda erio » ven giu 25, 2010 12:43

l'ho messo su slax remix 7,che è slackware 13.1,però ho aggiunto quasi tutto il modulo l di slackware,e qualche freeze ci stà ogni tanto...
erio
Linux 3.x
Linux 3.x
 
Messaggi: 1077
Iscritto il: ven ott 09, 2009 18:25
Slackware: 13.37
Kernel: 3.0.7
Desktop: kde

Re: Elightenment e17 builder - Segnalazioni

Messaggioda danix » mar giu 29, 2010 22:07

jimmy dovresti allegare lo slackbuild in formato txt al primo post, così è più facile scaricarlo... copiando dal code di phpbb gli spazi vengono tutti sballati... Inoltre dovresti mettere un link a questa discussione nel wiki, così è più facile reperirla e segnalare eventuali problemi... ;)
Avatar utente
danix
Staff
Staff
 
Messaggi: 3280
Iscritto il: ven ott 27, 2006 18:32
Località: Siderno (RC)
Nome Cognome: Danilo M.
Slackware: 64 14.0
Kernel: 3.2.29
Desktop: fluxbox

Re: Elightenment e17 builder - Segnalazioni

Messaggioda Blallo » mar giu 29, 2010 22:15

danix ha scritto:jimmy dovresti allegare lo slackbuild in formato txt al primo post, così è più facile scaricarlo... copiando dal code di phpbb gli spazi vengono tutti sballati... Inoltre dovresti mettere un link a questa discussione nel wiki, così è più facile reperirla e segnalare eventuali problemi... ;)

All done
grazie danix! ;)
Io sono il detective Arsenio Magret, e porto sempre la camicia TATUATA!
Avatar utente
Blallo
Packager
Packager
 
Messaggi: 3226
Iscritto il: ven ott 12, 2007 10:37
Località: Torino / Torremaggiore (FG)
Nome Cognome: Savino Liguori
Slackware: 14.1 / 12.2
Kernel: 3.12.2-ck
Desktop: Openbox

Re: Elightenment e17 builder - Segnalazioni

Messaggioda erio » gio lug 01, 2010 13:56

ciao jimmy page 89 ricompilando e17 si ferma qui senza errori boh!!:
ch=i486 -mtune=i686 -MT sse2_cmod.lo -MD -MP -MF .deps/sse2_cmod.Tpo -c sse2_cmod.c -fPIC -DPIC -o .libs/sse2_cmod.o
mv -f .deps/libscream.Tpo .deps/libscream.Plo
make[2]: Leaving directory `/tmp/buildpkgs/enlightenment/e/trunk/eterm/Eterm/src'
make[1]: Leaving directory `/tmp/buildpkgs/enlightenment/e/trunk/eterm/Eterm'
bash-4.1#
qualche hint.
erio
Linux 3.x
Linux 3.x
 
Messaggi: 1077
Iscritto il: ven ott 09, 2009 18:25
Slackware: 13.37
Kernel: 3.0.7
Desktop: kde

Re: Elightenment e17 builder - Segnalazioni

Messaggioda Blallo » gio lug 01, 2010 14:11

posta error.log (mettilo nei tag code, è più leggibile)
Io sono il detective Arsenio Magret, e porto sempre la camicia TATUATA!
Avatar utente
Blallo
Packager
Packager
 
Messaggi: 3226
Iscritto il: ven ott 12, 2007 10:37
Località: Torino / Torremaggiore (FG)
Nome Cognome: Savino Liguori
Slackware: 14.1 / 12.2
Kernel: 3.12.2-ck
Desktop: Openbox

Re: Elightenment e17 builder - Segnalazioni

Messaggioda erio » gio lug 01, 2010 14:58

Codice: Seleziona tutto
--- eina building error log ---
eina_buddy.c: In function '_statistics':
eina_buddy.c:228: warning: format '%li' expects type 'long int', but argument 2 has type 'size_t'
eina_buddy.c:228: warning: format '%lu' expects type 'long unsigned int', but argument 7 has type 'unsigned int'
eina_buddy.c:238: warning: format '%li' expects type 'long int', but argument 2 has type 'int'
--- eet building error log ---
--- imlib2_loaders building error log ---
--- evas building error log ---
evas_object_textblock.c: In function 'evas_textblock_style_set':
evas_object_textblock.c:2618: warning: ignoring return value of 'evas_object_textblock_text_markup_get', declared with attribute warn_unused_result
evas_object_textblock.c: In function 'evas_object_textblock_style_set':
evas_object_textblock.c:2761: warning: ignoring return value of 'evas_object_textblock_text_markup_get', declared with attribute warn_unused_result
evas_convert_rgb_8.c: In function 'evas_common_convert_rgba_to_8bpp_rgb_332_dith':
evas_convert_rgb_8.c:28: warning: right shift count is negative
evas_convert_rgb_8.c:29: warning: right shift count is negative
evas_convert_rgb_8.c: In function 'evas_common_convert_rgba_to_8bpp_rgb_232_dith':
evas_convert_rgb_8.c:101: warning: right shift count is negative
evas_convert_rgb_8.c:102: warning: right shift count is negative
evas_convert_rgb_8.c: In function 'evas_common_convert_rgba_to_8bpp_rgb_222_dith':
evas_convert_rgb_8.c:134: warning: right shift count is negative
evas_convert_rgb_8.c: In function 'evas_common_convert_rgba_to_8bpp_rgb_221_dith':
evas_convert_rgb_8.c:166: warning: right shift count is negative
evas_convert_rgb_8.c:167: warning: right shift count is negative
evas_convert_rgb_8.c: In function 'evas_common_convert_rgba_to_8bpp_rgb_121_dith':
evas_convert_rgb_8.c:199: warning: right shift count is negative
evas_convert_rgb_8.c:200: warning: right shift count is negative
evas_convert_rgb_8.c: In function 'evas_common_convert_rgba_to_8bpp_rgb_111_dith':
evas_convert_rgb_8.c:233: warning: right shift count is negative
evas_intl_utils.c: In function 'evas_intl_utf8_to_visual':
evas_intl_utils.c:50: warning: passing argument 1 of 'fribidi_utf8_to_unicode' discards qualifiers from pointer target type
/usr/include/fribidi/fribidi_char_sets_utf8.h:49: note: expected 'char *' but argument is of type 'const char *'
evas_engine.c: In function '_sym_init':
evas_engine.c:83: warning: assignment from incompatible pointer type
evas_engine.c:84: warning: assignment from incompatible pointer type
evas_engine.c:85: warning: assignment from incompatible pointer type
evas_engine.c:87: warning: assignment from incompatible pointer type
evas_engine.c:88: warning: assignment from incompatible pointer type
evas_engine.c:89: warning: assignment from incompatible pointer type
evas_engine.c:91: warning: assignment from incompatible pointer type
evas_engine.c:92: warning: assignment from incompatible pointer type
evas_engine.c:93: warning: assignment from incompatible pointer type
evas_engine.c:95: warning: assignment from incompatible pointer type
evas_engine.c:97: warning: assignment from incompatible pointer type
evas_engine.c:99: warning: assignment from incompatible pointer type
evas_engine.c:100: warning: assignment from incompatible pointer type
evas_engine.c:101: warning: assignment from incompatible pointer type
evas_engine.c:103: warning: assignment from incompatible pointer type
evas_engine.c:104: warning: assignment from incompatible pointer type
evas_engine.c:105: warning: assignment from incompatible pointer type
evas_engine.c:107: warning: assignment from incompatible pointer type
evas_engine.c:108: warning: assignment from incompatible pointer type
evas_engine.c:109: warning: assignment from incompatible pointer type
evas_engine.c: In function '_output_xlib_setup':
evas_engine.c:212: warning: assignment from incompatible pointer type
evas_engine.c:213: warning: assignment from incompatible pointer type
evas_engine.c:214: warning: assignment from incompatible pointer type
evas_engine.c:232: warning: assignment from incompatible pointer type
evas_engine.c:252: warning: assignment from incompatible pointer type
evas_engine.c:260: warning: assignment from incompatible pointer type
evas_engine.c:261: warning: assignment from incompatible pointer type
evas_engine.c: In function 'module_open':
evas_engine.c:1554: warning: assignment from incompatible pointer type
evas_engine.c:1577: warning: assignment from incompatible pointer type
evas_image_save_png.c: In function 'save_image_png':
evas_image_save_png.c:74: warning: 'interlaced' is deprecated (declared at /usr/include/libpng14/png.h:1196)
evas_image_save_png.c:92: warning: 'interlaced' is deprecated (declared at /usr/include/libpng14/png.h:1196)
evas_image_save_png.c:105: warning: 'interlaced' is deprecated (declared at /usr/include/libpng14/png.h:1196)
--- ecore building error log ---
libtool: link: warning: `-version-info/-version-number' is ignored for convenience libraries
ecore_config_ipc_main.c: In function '_ecore_config_ipc_init':
ecore_config_ipc_main.c:276: warning: passing argument 2 of 'ecore_timer_add' from incompatible pointer type
../../../src/lib/ecore/Ecore.h:352: note: expected 'Eina_Bool (*)(void *)' but argument is of type 'int (*)(void *)'
ecore_config_ipc_ecore.c: In function '_ecore_config_ipc_ecore_init':
ecore_config_ipc_ecore.c:333: warning: passing argument 2 of 'ecore_event_handler_add' from incompatible pointer type
../../../src/lib/ecore/Ecore.h:263: note: expected 'Eina_Bool (*)(void *, int,  void *)' but argument is of type 'int (*)(void *, int,  void *)'
ecore_config_ipc_ecore.c:335: warning: passing argument 2 of 'ecore_event_handler_add' from incompatible pointer type
../../../src/lib/ecore/Ecore.h:263: note: expected 'Eina_Bool (*)(void *, int,  void *)' but argument is of type 'int (*)(void *, int,  void *)'
ecore_config_ipc_ecore.c:337: warning: passing argument 2 of 'ecore_event_handler_add' from incompatible pointer type
../../../src/lib/ecore/Ecore.h:263: note: expected 'Eina_Bool (*)(void *, int,  void *)' but argument is of type 'int (*)(void *, int,  void *)'
.... done.
.... done.
..... done.
.... done.
35 translated messages.
.... done.
23 translated messages, 12 untranslated messages.
35 translated messages.
35 translated messages.
35 translated messages.
--- efreet building error log ---
--- embryo building error log ---
--- edje building error log ---
edje_amalgamation.c: In function '_edje_gradient_recalc_apply':
edje_amalgamation.c:1475: warning: 'evas_object_gradient_fill_angle_set' is deprecated (declared at /usr/include/Evas.h:1445)
edje_amalgamation.c:1476: warning: 'evas_object_gradient_fill_spread_set' is deprecated (declared at /usr/include/Evas.h:1447)
edje_amalgamation.c:1477: warning: 'evas_object_gradient_fill_set' is deprecated (declared at /usr/include/Evas.h:1443)
edje_amalgamation.c:1481: warning: 'evas_object_gradient_type_set' is deprecated (declared at /usr/include/Evas.h:1441)
edje_amalgamation.c:1493: warning: 'evas_object_gradient_clear' is deprecated (declared at /usr/include/Evas.h:1440)
edje_amalgamation.c:1496: warning: 'evas_object_gradient_color_stop_add' is deprecated (declared at /usr/include/Evas.h:1436)
edje_amalgamation.c:1499: warning: 'evas_object_gradient_alpha_stop_add' is deprecated (declared at /usr/include/Evas.h:1437)
edje_amalgamation.c: In function '_edje_object_file_set_internal':
edje_amalgamation.c:13061: warning: 'evas_object_gradient_add' is deprecated (declared at /usr/include/Evas.h:1435)
edje_amalgamation.c: In function '_edje_edit_real_part_add':
edje_amalgamation.c:28721: warning: 'evas_object_gradient_add' is deprecated (declared at /usr/include/Evas.h:1435)
--- e_dbus building error log ---
e_dbus_ofono_test.c: In function 'main':
e_dbus_ofono_test.c:494: warning: passing argument 2 of 'ecore_event_handler_add' from incompatible pointer type
/usr/include/Ecore.h:263: note: expected 'Eina_Bool (*)(void *, int,  void *)' but argument is of type 'int (*)(void *, int,  void *)'
e_dbus_ofono_test.c:495: warning: passing argument 2 of 'ecore_event_handler_add' from incompatible pointer type
/usr/include/Ecore.h:263: note: expected 'Eina_Bool (*)(void *, int,  void *)' but argument is of type 'int (*)(void *, int,  void *)'
e_dbus_ofono_test.c:497: warning: passing argument 2 of 'ecore_event_handler_add' from incompatible pointer type
/usr/include/Ecore.h:263: note: expected 'Eina_Bool (*)(void *, int,  void *)' but argument is of type 'int (*)(void *, int,  void *)'
e_dbus_ofono_test.c:500: warning: passing argument 3 of 'ecore_main_fd_handler_add' from incompatible pointer type
/usr/include/Ecore.h:320: note: expected 'Eina_Bool (*)(void *, struct Ecore_Fd_Handler *)' but argument is of type 'int (*)(void *, struct Ecore_Fd_Handler *)'
--- eeze building error log ---
--- e building error log ---
e_widget_cslider.c: In function 'e_widget_cslider_add':
e_widget_cslider.c:75: warning: 'evas_object_gradient_add' is deprecated (declared at /usr/include/Evas.h:1435)
e_widget_cslider.c:79: warning: 'evas_object_gradient_angle_set' is deprecated (declared at /usr/include/Evas.h:1449)
e_widget_cslider.c:81: warning: 'evas_object_gradient_angle_set' is deprecated (declared at /usr/include/Evas.h:1449)
e_widget_cslider.c: In function '_e_wid_resize':
e_widget_cslider.c:113: warning: 'evas_object_gradient_fill_set' is deprecated (declared at /usr/include/Evas.h:1443)
e_widget_cslider.c: In function '_e_wid_update_standard':
e_widget_cslider.c:206: warning: 'evas_object_gradient_clear' is deprecated (declared at /usr/include/Evas.h:1440)
e_widget_cslider.c:211: warning: 'evas_object_gradient_color_stop_add' is deprecated (declared at /usr/include/Evas.h:1436)
e_widget_cslider.c:212: warning: 'evas_object_gradient_color_stop_add' is deprecated (declared at /usr/include/Evas.h:1436)
e_widget_cslider.c:216: warning: 'evas_object_gradient_color_stop_add' is deprecated (declared at /usr/include/Evas.h:1436)
e_widget_cslider.c:217: warning: 'evas_object_gradient_color_stop_add' is deprecated (declared at /usr/include/Evas.h:1436)
e_widget_cslider.c:221: warning: 'evas_object_gradient_color_stop_add' is deprecated (declared at /usr/include/Evas.h:1436)
e_widget_cslider.c:222: warning: 'evas_object_gradient_color_stop_add' is deprecated (declared at /usr/include/Evas.h:1436)
e_widget_cslider.c:228: warning: 'evas_object_gradient_color_stop_add' is deprecated (declared at /usr/include/Evas.h:1436)
e_widget_cslider.c:229: warning: 'evas_object_gradient_color_stop_add' is deprecated (declared at /usr/include/Evas.h:1436)
e_widget_cslider.c:230: warning: 'evas_object_gradient_color_stop_add' is deprecated (declared at /usr/include/Evas.h:1436)
e_widget_cslider.c:231: warning: 'evas_object_gradient_color_stop_add' is deprecated (declared at /usr/include/Evas.h:1436)
e_widget_cslider.c:232: warning: 'evas_object_gradient_color_stop_add' is deprecated (declared at /usr/include/Evas.h:1436)
e_widget_cslider.c:233: warning: 'evas_object_gradient_color_stop_add' is deprecated (declared at /usr/include/Evas.h:1436)
e_widget_cslider.c:234: warning: 'evas_object_gradient_color_stop_add' is deprecated (declared at /usr/include/Evas.h:1436)
e_widget_cslider.c:239: warning: 'evas_object_gradient_color_stop_add' is deprecated (declared at /usr/include/Evas.h:1436)
e_widget_cslider.c:241: warning: 'evas_object_gradient_color_stop_add' is deprecated (declared at /usr/include/Evas.h:1436)
e_widget_cslider.c:246: warning: 'evas_object_gradient_color_stop_add' is deprecated (declared at /usr/include/Evas.h:1436)
e_widget_cslider.c:248: warning: 'evas_object_gradient_color_stop_add' is deprecated (declared at /usr/include/Evas.h:1436)
e_widget_cslider.c: In function '_e_wid_update_fixed':
e_widget_cslider.c:265: warning: 'evas_object_gradient_clear' is deprecated (declared at /usr/include/Evas.h:1440)
e_widget_cslider.c:269: warning: 'evas_object_gradient_color_stop_add' is deprecated (declared at /usr/include/Evas.h:1436)
e_widget_cslider.c:270: warning: 'evas_object_gradient_color_stop_add' is deprecated (declared at /usr/include/Evas.h:1436)
e_widget_cslider.c:274: warning: 'evas_object_gradient_color_stop_add' is deprecated (declared at /usr/include/Evas.h:1436)
e_widget_cslider.c:275: warning: 'evas_object_gradient_color_stop_add' is deprecated (declared at /usr/include/Evas.h:1436)
e_widget_cslider.c:279: warning: 'evas_object_gradient_color_stop_add' is deprecated (declared at /usr/include/Evas.h:1436)
e_widget_cslider.c:280: warning: 'evas_object_gradient_color_stop_add' is deprecated (declared at /usr/include/Evas.h:1436)
e_widget_cslider.c:297: warning: 'evas_object_gradient_color_stop_add' is deprecated (declared at /usr/include/Evas.h:1436)
e_widget_cslider.c:298: warning: 'evas_object_gradient_color_stop_add' is deprecated (declared at /usr/include/Evas.h:1436)
e_widget_cslider.c:299: warning: 'evas_object_gradient_color_stop_add' is deprecated (declared at /usr/include/Evas.h:1436)
e_widget_cslider.c:300: warning: 'evas_object_gradient_color_stop_add' is deprecated (declared at /usr/include/Evas.h:1436)
e_widget_cslider.c:301: warning: 'evas_object_gradient_color_stop_add' is deprecated (declared at /usr/include/Evas.h:1436)
e_widget_cslider.c:302: warning: 'evas_object_gradient_color_stop_add' is deprecated (declared at /usr/include/Evas.h:1436)
e_widget_cslider.c:303: warning: 'evas_object_gradient_color_stop_add' is deprecated (declared at /usr/include/Evas.h:1436)
e_widget_cslider.c:307: warning: 'evas_object_gradient_color_stop_add' is deprecated (declared at /usr/include/Evas.h:1436)
e_widget_cslider.c:308: warning: 'evas_object_gradient_color_stop_add' is deprecated (declared at /usr/include/Evas.h:1436)
e_widget_cslider.c:312: warning: 'evas_object_gradient_color_stop_add' is deprecated (declared at /usr/include/Evas.h:1436)
e_widget_cslider.c:313: warning: 'evas_object_gradient_color_stop_add' is deprecated (declared at /usr/include/Evas.h:1436)
e_int_config_wallpaper_gradient.c: In function '_preview_widget_add':
e_int_config_wallpaper_gradient.c:418: warning: 'evas_object_gradient_add' is deprecated (declared at /usr/include/Evas.h:1435)
e_int_config_wallpaper_gradient.c: In function '_import_cb_on_change':
e_int_config_wallpaper_gradient.c:440: warning: 'evas_object_gradient_clear' is deprecated (declared at /usr/include/Evas.h:1440)
e_int_config_wallpaper_gradient.c:441: warning: 'evas_object_gradient_color_stop_add' is deprecated (declared at /usr/include/Evas.h:1436)
e_int_config_wallpaper_gradient.c:442: warning: 'evas_object_gradient_color_stop_add' is deprecated (declared at /usr/include/Evas.h:1436)
e_int_config_wallpaper_gradient.c:447: warning: 'evas_object_gradient_type_set' is deprecated (declared at /usr/include/Evas.h:1441)
e_int_config_wallpaper_gradient.c:448: warning: 'evas_object_gradient_angle_set' is deprecated (declared at /usr/include/Evas.h:1449)
e_int_config_wallpaper_gradient.c:449: warning: 'evas_object_gradient_fill_set' is deprecated (declared at /usr/include/Evas.h:1443)
e_int_config_wallpaper_gradient.c:452: warning: 'evas_object_gradient_type_set' is deprecated (declared at /usr/include/Evas.h:1441)
e_int_config_wallpaper_gradient.c:453: warning: 'evas_object_gradient_angle_set' is deprecated (declared at /usr/include/Evas.h:1449)
e_int_config_wallpaper_gradient.c:454: warning: 'evas_object_gradient_fill_set' is deprecated (declared at /usr/include/Evas.h:1443)
e_int_config_wallpaper_gradient.c:457: warning: 'evas_object_gradient_type_set' is deprecated (declared at /usr/include/Evas.h:1441)
e_int_config_wallpaper_gradient.c:458: warning: 'evas_object_gradient_angle_set' is deprecated (declared at /usr/include/Evas.h:1449)
e_int_config_wallpaper_gradient.c:459: warning: 'evas_object_gradient_fill_set' is deprecated (declared at /usr/include/Evas.h:1443)
e_int_config_wallpaper_gradient.c:462: warning: 'evas_object_gradient_type_set' is deprecated (declared at /usr/include/Evas.h:1441)
e_int_config_wallpaper_gradient.c:463: warning: 'evas_object_gradient_angle_set' is deprecated (declared at /usr/include/Evas.h:1449)
e_int_config_wallpaper_gradient.c:464: warning: 'evas_object_gradient_fill_set' is deprecated (declared at /usr/include/Evas.h:1443)
e_int_config_wallpaper_gradient.c:467: warning: 'evas_object_gradient_type_set' is deprecated (declared at /usr/include/Evas.h:1441)
e_int_config_wallpaper_gradient.c:468: warning: 'evas_object_gradient_fill_set' is deprecated (declared at /usr/include/Evas.h:1443)
................................................................................................................................................................................................................................................................................................................................ done.
 done.
................................................................................................................................................................ done.
................................................................................................................................................................ done.
............................................................................................................................................................................................................................................................................................................................... done.
. done.
................................................................................................................................................................ done.
................................................................................................................................................................ done.
................................................................................................................................................................ done.
................................................................................................................................................................ done.
................................................................................................................................................................ done.
................................................................................................................................................................ done.
............................................................................................................................................................................................................................................................................................................................... done.
 done.
................................................................................................................................................................ done.
................................................................................................................................................................ done.
................................................................................................................................................................ done.
................................................................................................................................................................ done.
................................................................................................................................................................ done.
................................................................................................................................................................ done.
................................................................................................................................................................................................................................................................................................................................ done.
 done.
................................................................................................................................................................ done.
................................................................................................................................................................ done.
............................................................................................................................................................... done.
................................................................................................................................................................ done.
................................................................................................................................................................ done.
................................................................................................................................................................ done.
................................................................................................................................................................ done.
................................................................................................................................................................ done.
................................................................................................................................................................ done.
............................................................................................................................................................... done.
................................................................................................................................................................ done.
................................................................................................................................................................ done.
................................................................................................................................................................ done.
tr.po:1310: internationalized messages should not contain the `\r' escape sequence
................................................................................................................................................................ done.
................................................................................................................................................................ done.
............................................................................................................................................................... done.
931 translated messages, 192 fuzzy translations, 459 untranslated messages.
916 translated messages, 209 fuzzy translations, 457 untranslated messages.
816 translated messages, 463 fuzzy translations, 303 untranslated messages.
1323 translated messages, 215 fuzzy translations, 44 untranslated messages.
289 translated messages, 109 fuzzy translations, 1184 untranslated messages.
1261 translated messages, 222 fuzzy translations, 99 untranslated messages.
1294 translated messages, 225 fuzzy translations, 63 untranslated messages.
1215 translated messages, 162 fuzzy translations, 205 untranslated messages.
1271 translated messages, 223 fuzzy translations, 88 untranslated messages.
8 translated messages, 1574 untranslated messages.
136 translated messages, 37 fuzzy translations, 1409 untranslated messages.
1296 translated messages, 226 fuzzy translations, 60 untranslated messages.
882 translated messages, 556 fuzzy translations, 144 untranslated messages.
1582 translated messages.
595 translated messages, 145 fuzzy translations, 842 untranslated messages.
1292 translated messages, 226 fuzzy translations, 64 untranslated messages.
1288 translated messages, 225 fuzzy translations, 69 untranslated messages.
1582 translated messages.
58 translated messages, 30 fuzzy translations, 1494 untranslated messages.
1128 translated messages, 311 fuzzy translations, 143 untranslated messages.
5 translated messages, 5 fuzzy translations, 1572 untranslated messages.
570 translated messages, 175 fuzzy translations, 837 untranslated messages.
16 translated messages, 5 fuzzy translations, 1561 untranslated messages.
1294 translated messages, 225 fuzzy translations, 63 untranslated messages.
338 translated messages, 117 fuzzy translations, 1127 untranslated messages.
678 translated messages, 201 fuzzy translations, 703 untranslated messages.
734 translated messages, 188 fuzzy translations, 660 untranslated messages.
758 translated messages, 183 fuzzy translations, 641 untranslated messages.
959 translated messages, 200 fuzzy translations, 423 untranslated messages.
164 translated messages, 53 fuzzy translations, 1365 untranslated messages.
1262 translated messages, 221 fuzzy translations, 99 untranslated messages.
1158 translated messages, 217 fuzzy translations, 207 untranslated messages.
731 translated messages, 230 fuzzy translations, 621 untranslated messages.
285 translated messages, 828 fuzzy translations, 469 untranslated messages.
1264 translated messages, 201 fuzzy translations, 117 untranslated messages.
1287 translated messages, 213 fuzzy translations, 82 untranslated messages.
1294 translated messages, 225 fuzzy translations, 63 untranslated messages.
928 translated messages, 502 fuzzy translations, 152 untranslated messages.
--- esmart building error log ---
esmart_container.c: In function 'esmart_container_sort':
esmart_container.c:53: warning: passing argument 3 of 'eina_list_sort' from incompatible pointer type
/usr/include/eina-0/eina/eina_list.h:97: note: expected 'Eina_Compare_Cb' but argument is of type 'int (*)(void *, void *)'
esmart_container.c: In function '_container_element_move':
esmart_container.c:630: warning: ignoring return value of 'eina_list_append_relative', declared with attribute warn_unused_result
esmart_container.c:632: warning: ignoring return value of 'eina_list_prepend', declared with attribute warn_unused_result
default.c: In function '_default_scroll_start':
default.c:246: warning: passing argument 2 of 'ecore_timer_add' from incompatible pointer type
/usr/include/Ecore.h:352: note: expected 'Eina_Bool (*)(void *)' but argument is of type 'int (*)(void *)'
engage.c: In function '_engage_scroll_start':
engage.c:316: warning: passing argument 2 of 'ecore_timer_add' from incompatible pointer type
/usr/include/Ecore.h:352: note: expected 'Eina_Bool (*)(void *)' but argument is of type 'int (*)(void *)'
engage.c: In function 'engage_zoom_in':
engage.c:387: warning: passing argument 2 of 'ecore_timer_add' from incompatible pointer type
/usr/include/Ecore.h:352: note: expected 'Eina_Bool (*)(void *)' but argument is of type 'int (*)(void *)'
engage.c: In function 'engage_zoom_out':
engage.c:397: warning: passing argument 2 of 'ecore_timer_add' from incompatible pointer type
/usr/include/Ecore.h:352: note: expected 'Eina_Bool (*)(void *)' but argument is of type 'int (*)(void *)'
entice.c: In function '_entice_scroll_start':
entice.c:231: warning: passing argument 2 of 'ecore_timer_add' from incompatible pointer type
/usr/include/Ecore.h:352: note: expected 'Eina_Bool (*)(void *)' but argument is of type 'int (*)(void *)'
esmart_trans_x11.c: In function '_esmart_trans_x11_property_cb':
esmart_trans_x11.c:452: warning: passing argument 2 of 'ecore_timer_add' from incompatible pointer type
/usr/include/Ecore.h:352: note: expected 'Eina_Bool (*)(void *)' but argument is of type 'int (*)(void *)'
esmart_trans_x11.c: In function '_esmart_trans_x11_smart_get':
esmart_trans_x11.c:495: warning: passing argument 2 of 'ecore_event_handler_add' from incompatible pointer type
/usr/include/Ecore.h:263: note: expected 'Eina_Bool (*)(void *, int,  void *)' but argument is of type 'int (*)(void *, int,  void *)'
esmart_xpixmap.c: In function '_smart_add':
esmart_xpixmap.c:240: warning: passing argument 2 of 'ecore_event_handler_add' from incompatible pointer type
/usr/include/Ecore.h:263: note: expected 'Eina_Bool (*)(void *, int,  void *)' but argument is of type 'int (*)(void *, int,  void *)'
esmart_xpixmap.c:242: warning: passing argument 2 of 'ecore_event_handler_add' from incompatible pointer type
/usr/include/Ecore.h:263: note: expected 'Eina_Bool (*)(void *, int,  void *)' but argument is of type 'int (*)(void *, int,  void *)'
esmart_xpixmap.c:244: warning: passing argument 2 of 'ecore_event_handler_add' from incompatible pointer type
/usr/include/Ecore.h:263: note: expected 'Eina_Bool (*)(void *, int,  void *)' but argument is of type 'int (*)(void *, int,  void *)'
esmart_xpixmap.c:246: warning: passing argument 2 of 'ecore_event_handler_add' from incompatible pointer type
/usr/include/Ecore.h:263: note: expected 'Eina_Bool (*)(void *, int,  void *)' but argument is of type 'int (*)(void *, int,  void *)'
esmart_xpixmap.c:248: warning: passing argument 2 of 'ecore_event_handler_add' from incompatible pointer type
/usr/include/Ecore.h:263: note: expected 'Eina_Bool (*)(void *, int,  void *)' but argument is of type 'int (*)(void *, int,  void *)'
--- eterm building error log ---
misc.c: In function 'str_trim':
misc.c:101: warning: comparison of distinct pointer types lacks a cast
options.c: In function 'save_config':
options.c:3891: warning: pointer type mismatch in conditional expression
libscream.c:1489:2: warning: #warning compiling in libscream
libscream.c:1495:2: warning: #warning compiling in support for GNU screen
sse2_cmod.c: In function 'shade_ximage_15_sse2':
sse2_cmod.c:93: error: can't find a register in class 'BREG' while reloading 'asm'
sse2_cmod.c:93: error: 'asm' operand has impossible constraints
make[2]: *** [sse2_cmod.lo] Error 1
make[2]: *** Waiting for unfinished jobs....
make[1]: *** [all-recursive] Error 1
make: *** [all] Error 2
erio
Linux 3.x
Linux 3.x
 
Messaggi: 1077
Iscritto il: ven ott 09, 2009 18:25
Slackware: 13.37
Kernel: 3.0.7
Desktop: kde

Re: Elightenment e17 builder - Segnalazioni

Messaggioda Blallo » gio lug 01, 2010 18:51

aspetta un po' e riprova più in la
anche io ieri ho provato a ricompilare, e mi dava un errore
ogni tanto modificano il ramo
Io sono il detective Arsenio Magret, e porto sempre la camicia TATUATA!
Avatar utente
Blallo
Packager
Packager
 
Messaggi: 3226
Iscritto il: ven ott 12, 2007 10:37
Località: Torino / Torremaggiore (FG)
Nome Cognome: Savino Liguori
Slackware: 14.1 / 12.2
Kernel: 3.12.2-ck
Desktop: Openbox

Re: Elightenment e17 builder - Segnalazioni

Messaggioda erio » gio lug 01, 2010 19:00

grazie ,avevo istallato tutti i pacchetti lisci come olio,anche flickcurl con autoconfigure.sh,ok riprovo domani,comunque sulla 64 bit E17 sembra girare meglio
erio
Linux 3.x
Linux 3.x
 
Messaggi: 1077
Iscritto il: ven ott 09, 2009 18:25
Slackware: 13.37
Kernel: 3.0.7
Desktop: kde

Re: Elightenment e17 builder - Segnalazioni

Messaggioda Blallo » gio lug 01, 2010 19:02

infatti mi sta dando un sacco di soddisfazioni
devo solo capire come abilitare lo spegnimento dal menu per utente normale (sarà qualcosa di permessi)
Io sono il detective Arsenio Magret, e porto sempre la camicia TATUATA!
Avatar utente
Blallo
Packager
Packager
 
Messaggi: 3226
Iscritto il: ven ott 12, 2007 10:37
Località: Torino / Torremaggiore (FG)
Nome Cognome: Savino Liguori
Slackware: 14.1 / 12.2
Kernel: 3.12.2-ck
Desktop: Openbox

Re: Elightenment e17 builder - Segnalazioni

Messaggioda erio » gio lug 01, 2010 19:13

io invece cercavo come fare la mensola trasparente,senza riuscirci
erio
Linux 3.x
Linux 3.x
 
Messaggi: 1077
Iscritto il: ven ott 09, 2009 18:25
Slackware: 13.37
Kernel: 3.0.7
Desktop: kde

Re: Elightenment e17 builder - Segnalazioni

Messaggioda Blallo » gio lug 01, 2010 19:18

c'è negli stili delle shelf (si chiama proprio invisibile)
Io sono il detective Arsenio Magret, e porto sempre la camicia TATUATA!
Avatar utente
Blallo
Packager
Packager
 
Messaggi: 3226
Iscritto il: ven ott 12, 2007 10:37
Località: Torino / Torremaggiore (FG)
Nome Cognome: Savino Liguori
Slackware: 14.1 / 12.2
Kernel: 3.12.2-ck
Desktop: Openbox

Re: Elightenment e17 builder - Segnalazioni

Messaggioda Amrod » ven lug 02, 2010 12:32

oppure, se selezioni il gadget, nel menu delle impostazioni scegli "sposta questo gadget" -> desktop
e hai, invece delle shelf, i gadget spostabili ovunque come i primi snapshot di e17
Amrod
Linux 1.0
Linux 1.0
 
Messaggi: 91
Iscritto il: sab dic 09, 2006 19:03
Località: Cantu' -Co-
Slackware: x86_64 current
Desktop: Openbox

Re: Elightenment e17 builder - Segnalazioni

Messaggioda erio » lun lug 05, 2010 21:52

robert plant 89 ancora buio pesto sul versante e 17 non riesco a compilare,se potessi passare lo scoglio ecore con il warning too many argument ecc ecc nello script ecore_evas_x.c come lo modifico:questo penso che sia il pezzo che da errore:
# ifdef BUILD_ECORE_EVAS_SOFTWARE_XCB
xcb_screen_t *screen;

screen = ecore_x_default_screen_get();
einfo->info.visual = xcb_visualtype_get(screen, screen->root_visual);
einfo->info.colormap = screen->default_colormap;
einfo->info.depth = screen->root_depth;
#else
einfo->info.visual = DefaultVisual(ecore_x_display_get(), screen);
einfo->info.colormap = DefaultColormap(ecore_x_display_get(), screen);
einfo->info.depth = DefaultDepth(ecore_x_display_get(), screen);
erio
Linux 3.x
Linux 3.x
 
Messaggi: 1077
Iscritto il: ven ott 09, 2009 18:25
Slackware: 13.37
Kernel: 3.0.7
Desktop: kde

Re: Elightenment e17 builder - Segnalazioni

Messaggioda Amrod » mar lug 06, 2010 11:37

Enlightenment andrebbe sempre compilato partendo dagli snapshot che vengono rilasciati
quando si raggiunge una certa stabilita'.
L'ultimo rilasciato ha come revisione (o versione? come si traduce revision? ) di
SVN 49898, non so se sia possibile indicare nello slackbuild che versione scaricare.

Piccolo suggerimento, non conviene fare 2 slackbuild? uno per le EFL + enlightenment
e uno per il resto? di solito danno piu' rogne i moduli e i programmi che le librerie ed e.
Amrod
Linux 1.0
Linux 1.0
 
Messaggi: 91
Iscritto il: sab dic 09, 2006 19:03
Località: Cantu' -Co-
Slackware: x86_64 current
Desktop: Openbox

PrecedenteProssimo

Torna a Packages

Chi c’è in linea

Visitano il forum: Nessuno e 1 ospite