Repository 32bit  Forum
Repository 64bit  Wiki

inkscape su 14.1 [RISOLTO]

Postate qui se avete consigli per migliorare i pacchetti disponibili in questo sito o se avete problemi con installazione, funzionamento o altro.

Moderatore: Staff

Regole del forum
1) Citare in modo preciso il nome del pacchetto.
2) Specificare se discussione/suggerimento o richiesta d'aiuto.
3) Leggere attentamente le risposte ricevute
4) Scrivere i messaggi con il colore di default, evitare altri colori.
5) Scrivere in Italiano o in Inglese, se possibile grammaticalmente corretto, evitate stili di scrittura poco chiari, quindi nessuna abbreviazione tipo telegramma o scrittura stile SMS o CHAT.
6) Appena registrati è consigliato presentarsi nel forum dedicato.

La non osservanza delle regole porta a provvedimenti di vari tipo da parte dello staff, in particolare la non osservanza della regola 5 porta alla cancellazione del post e alla segnalazione dell'utente. In caso di recidività l'utente rischia il ban temporaneo.

inkscape su 14.1 [RISOLTO]

Messaggioda sunreal » sab nov 23, 2013 16:46

Ciao, nella mia beata ignoranza mi sono messo in testa ti installare innksscape su slack 14.1. Sono riuscito a compilare ed installare tutte le dipendenze senza errori apparenti, utilizzando gli slackbuild del repo di slack 14.0, ma alla fine lo slackbuild di inkscape mi da questo errore:
connector-context.cpp: In function 'void cc_selection_set_avoid(bool)':
connector-context.cpp:1940:33: warning: converting 'false' to pointer type for argument 4 of 'void sp_object_setAttribute(SPObject*, const gchar*, const gchar*, SPException*)' [-Wconversion-null]
value, false);
^
CXX console-output-undo-observer.o
CXX context-fns.o
CXX desktop.o
CXX desktop-events.o
In file included from desktop.cpp:91:0:
widgets/desktop-widget.h:242:32: error: stray ',' at end of member declaration
GtkWidget *commands_toolbox,;
^
make[2]: *** [desktop.o] Error 1
make[2]: *** Waiting for unfinished jobs....
In file included from desktop-events.cpp:41:0:
widgets/desktop-widget.h:242:32: error: stray ',' at end of member declaration
GtkWidget *commands_toolbox,;
^
make[2]: *** [desktop-events.o] Error 1
make[2]: Leaving directory `/tmp/buildpkgs/inkscape/inkscape-0.48.4/src'
make[1]: *** [all-recursive] Error 1
make[1]: Leaving directory `/tmp/buildpkgs/inkscape/inkscape-0.48.4'
make: *** [all] Error 2
Che cosa pò essere? Dimenticavo uso la 14.1 a 64bit
Ciao
Ultima modifica di sunreal il dom nov 24, 2013 13:49, modificato 1 volta in totale.
sunreal
Master
Master
 
Messaggi: 1554
Iscritto il: sab apr 09, 2005 23:00
Località: P.P.P.

Re: inkscape su 14.1

Messaggioda ponce » sab nov 23, 2013 18:15

puoi provare usando lo slackbuild di SBo (per ora solo in git)

http://slackbuilds.org/cgit/slackbuilds ... s/inkscape

se usi sbopkg, puoi anche usarlo direttamente col ramo master di git (che tra non moltissimo sara' promosso a repository ufficiale per la 14.1).
Avatar utente
ponce
Master
Master
 
Messaggi: 1500
Iscritto il: mer mar 05, 2008 16:45
Località: Pisa
Nome Cognome: Matteo Bernardini
Slackware: slackware64-current
Kernel: 3.17-rc3
Desktop: lxde

Re: inkscape su 14.1

Messaggioda IamSOMBER » sab nov 23, 2013 19:21

Al tempo anche io provai ad installare la versione stable.
Non mi ricordo più il tipo di errore ma non compilava, così ho provato la versione
scaricata con bzr, quella dev per intenderci, ed ha funzionato.
Avatar utente
IamSOMBER
Linux 2.4
Linux 2.4
 
Messaggi: 213
Iscritto il: mar nov 08, 2005 15:49
Località: Matelica (MC)
Nome Cognome: Mirko
Slackware: Slackware64 current
Kernel: 3.12.27
Desktop: KDE 4.14.0

Re: inkscape su 14.1

Messaggioda sunreal » sab nov 23, 2013 21:46

Come diceva il buon Rolando....
I cannotbelive!!!!!
Ho preso lo slackbuild consigliatomi e funzia!!
Grazie.
sunreal
Master
Master
 
Messaggi: 1554
Iscritto il: sab apr 09, 2005 23:00
Località: P.P.P.


Torna a Packages

Chi c’è in linea

Visitano il forum: Nessuno e 1 ospite