Repository 32bit  Forum
Repository 64bit  Wiki

Driver ati problema compilazione modulo.

Usate questo forum per richieste di aiuto e consigli sull'hardware montato nelle vostre macchine con GNU/Linux Slackware.

Moderatore: Staff

Regole del forum
1) Citare sempre la versione di Slackware usata e la versione del Kernel. Questi dati aiutano le persone che possono rispondere.
2) Citare il tipo di hardware coinvolto in modo dettagliato.
3) Leggere attentamente le risposte ricevute
4) Scrivere i messaggi con il colore di default, evitare altri colori.
5) Scrivere in Italiano o in Inglese, se possibile grammaticalmente corretto, evitate stili di scrittura poco chiari, quindi nessuna abbreviazione tipo telegramma o scrittura stile SMS o CHAT. Non usare termini gergali come procio, mobo e simili per identificare i componenti hardware.
6) Appena registrati è consigliato presentarsi nel forum dedicato.

La non osservanza delle regole porta a provvedimenti di vari tipo da parte dello staff, in particolare la non osservanza della regola 5 porta alla cancellazione del post e alla segnalazione dell'utente. In caso di recidività l'utente rischia il ban temporaneo.

Driver ati problema compilazione modulo.

Messaggioda Belzebu » dom set 18, 2005 17:37

Installando i driver 8.16.20 tento di compilare il modulo con l'apposito make.sh, ma la compilazione fallisce.
Ecco due stralci del log, dove inizia a dare errore e la fine.
...
...
...
include/linux/types.h:18: error: syntax error before "__kernel_dev_t"
include/linux/types.h:18: warning: type defaults to `int' in declaration of `__kernel_dev_t'
include/linux/types.h:18: warning: data definition has no type or storage class
include/linux/types.h:21: error: syntax error before "dev_t"
include/linux/types.h:21: warning: type defaults to `int' in declaration of `dev_t'
include/linux/types.h:21: warning: data definition has no type or storage class
include/linux/types.h:22: error: syntax error before "ino_t"
include/linux/types.h:22: warning: type defaults to `int' in declaration of `ino_t'
include/linux/types.h:22: warning: data definition has no type or storage class
...
...
...
make[2]: *** [/lib/modules/fglrx/build_mod/2.6.x/agp3.o] Error 1
make[1]: *** [_module_/lib/modules/fglrx/build_mod/2.6.x] Error 2
make[1]: Leaving directory `/usr/src/linux-2.6.13'
make: *** [kmod_build] Error 2
build failed with return value 2


Da quel che ho capito trova degli errori nei sorgenti del kernel; come è possibile?
Da cosa può dipendere? Sono i driver che non vanno bene o può davvero essrci qualcosa che non va nei miei sorgenti?
Belzebu
Linux 1.0
Linux 1.0
 
Messaggi: 23
Iscritto il: ven set 16, 2005 23:00

Messaggioda goldy » dom set 18, 2005 20:30

Credo che sia un problema con il kernel 2.6.13 e i driver ati,
ci sono altri post al riguardo sempre su questo sito.
Avatar utente
goldy
Packager
Packager
 
Messaggi: 1267
Iscritto il: dom mag 02, 2004 23:00
Località: Bologna
Slackware: Current
Kernel: 2.6.26.5
Desktop: KDE 3.5.10


Torna a Hardware

Chi c’è in linea

Visitano il forum: Nessuno e 3 ospiti

cron