Repository 32bit  Forum
Repository 64bit  Wiki

Elightenment e17 builder - Segnalazioni

Postate qui se avete consigli per migliorare i pacchetti disponibili in questo sito o se avete problemi con installazione, funzionamento o altro.

Moderatore: Staff

Regole del forum
1) Citare in modo preciso il nome del pacchetto.
2) Specificare se discussione/suggerimento o richiesta d'aiuto.
3) Leggere attentamente le risposte ricevute
4) Scrivere i messaggi con il colore di default, evitare altri colori.
5) Scrivere in Italiano o in Inglese, se possibile grammaticalmente corretto, evitate stili di scrittura poco chiari, quindi nessuna abbreviazione tipo telegramma o scrittura stile SMS o CHAT.
6) Appena registrati è consigliato presentarsi nel forum dedicato.

La non osservanza delle regole porta a provvedimenti di vari tipo da parte dello staff, in particolare la non osservanza della regola 5 porta alla cancellazione del post e alla segnalazione dell'utente. In caso di recidività l'utente rischia il ban temporaneo.

Re: Elightenment e17 builder - Segnalazioni

Messaggioda erio » mar lug 06, 2010 12:38

se non compila ecore, non va avanti perchè serve ad altre applicazioni di e,ho visto che lo script ecore evas x è diverso dalla versione 0.63 alla versione 49898 ma sta di fatto che non compila in tutte due le versioni,anche standalone,non ho gli strumenti per capire meglio come muovermi...
erio
Linux 3.x
Linux 3.x
 
Messaggi: 1069
Iscritto il: ven ott 09, 2009 18:25
Slackware: 13.37
Kernel: 3.0.7
Desktop: kde

Re: Elightenment e17 builder - Segnalazioni

Messaggioda conraid » mar lug 06, 2010 12:53

Amrod ha scritto:L'ultimo rilasciato ha come revisione (o versione? come si traduce revision? ) di
SVN 49898, non so se sia possibile indicare nello slackbuild che versione scaricare.


svn co -r 49898 etc...
Avatar utente
conraid
Staff
Staff
 
Messaggi: 12002
Iscritto il: mer lug 13, 2005 23:00
Località: Livorno
Nome Cognome: Corrado Franco
Slackware: current

Re: Elightenment e17 builder - Segnalazioni

Messaggioda Blallo » mar lug 06, 2010 13:48

un attimo che controllo approfonditamente la cosa, ora sto ricompilando chromium
Io sono il detective Arsenio Magret, e porto sempre la camicia TATUATA!
Avatar utente
Blallo
Packager
Packager
 
Messaggi: 3222
Iscritto il: ven ott 12, 2007 10:37
Località: Torino / Torremaggiore (FG)
Nome Cognome: Savino Liguori
Slackware: 14.1 / 12.2
Kernel: 3.12.2-ck
Desktop: Openbox

Re: Elightenment e17 builder - Segnalazioni

Messaggioda Amrod » mar lug 06, 2010 16:37

conraid ha scritto:svn co -r 49898 etc...


Sono io orbo come una talpa, guardando lo slackbuild avevo saltato
a pie' pari la riga dove c'era il comando svn e non capivo come lo
scaricasse #-o
Amrod
Linux 1.0
Linux 1.0
 
Messaggi: 91
Iscritto il: sab dic 09, 2006 19:03
Località: Cantu' -Co-
Slackware: x86_64 current
Desktop: Openbox

Re: Elightenment e17 builder - Segnalazioni

Messaggioda navajo » mar lug 06, 2010 17:35

quando crei o rispondi a un thread in alto partendo da sinistra hai dei tag o delle opzioni
hai la possibilità di scrivere in grassetto, corsivo, sottolineato (Biu) la possibilità di quotare, mettere appunto del codice, un list eccetera eccetera
Avatar utente
navajo
Staff
Staff
 
Messaggi: 3771
Iscritto il: gio gen 08, 2004 0:00
Località: Roma
Nome Cognome: Massimiliano
Slackware: 13.37 (x86_64)
Kernel: 2.6.37.6
Desktop: KDE 4.7.0 (Alien)

Re: Elightenment e17 builder - Segnalazioni

Messaggioda Blallo » mer ago 04, 2010 18:47

qualcuno può testare un po' il trunk attuale?
io sono con una connessione lumaca azzoppata
Io sono il detective Arsenio Magret, e porto sempre la camicia TATUATA!
Avatar utente
Blallo
Packager
Packager
 
Messaggi: 3222
Iscritto il: ven ott 12, 2007 10:37
Località: Torino / Torremaggiore (FG)
Nome Cognome: Savino Liguori
Slackware: 14.1 / 12.2
Kernel: 3.12.2-ck
Desktop: Openbox

Re: Elightenment e17 builder - Segnalazioni

Messaggioda erio » mer ago 04, 2010 21:34

pronti
erio
Linux 3.x
Linux 3.x
 
Messaggi: 1069
Iscritto il: ven ott 09, 2009 18:25
Slackware: 13.37
Kernel: 3.0.7
Desktop: kde

Re: Elightenment e17 builder - Segnalazioni

Messaggioda erio » mer ago 04, 2010 21:40

enlightenment.SlackBuild: line 80: svn: command not found
erio
Linux 3.x
Linux 3.x
 
Messaggi: 1069
Iscritto il: ven ott 09, 2009 18:25
Slackware: 13.37
Kernel: 3.0.7
Desktop: kde

Re: Elightenment e17 builder - Segnalazioni

Messaggioda Blallo » mer ago 04, 2010 22:14

ok..questo è un po strano...sei a posto con i pacchetti di slackware?
dammi un
Codice: Seleziona tutto
echo $PATH
da root
Io sono il detective Arsenio Magret, e porto sempre la camicia TATUATA!
Avatar utente
Blallo
Packager
Packager
 
Messaggi: 3222
Iscritto il: ven ott 12, 2007 10:37
Località: Torino / Torremaggiore (FG)
Nome Cognome: Savino Liguori
Slackware: 14.1 / 12.2
Kernel: 3.12.2-ck
Desktop: Openbox

Re: Elightenment e17 builder - Segnalazioni

Messaggioda erio » mer ago 04, 2010 22:31

echo $PATH
/usr/local/sbin:/usr/sbin:/sbin:/usr/local/bin:/usr/bin:/bin:/usr/games:/usr/lib/qt/bin:/usr/lib/qt/bin
erio
Linux 3.x
Linux 3.x
 
Messaggi: 1069
Iscritto il: ven ott 09, 2009 18:25
Slackware: 13.37
Kernel: 3.0.7
Desktop: kde

Re: Elightenment e17 builder - Segnalazioni

Messaggioda Blallo » mer ago 04, 2010 22:48

sembra tutto a posto
prova a dare svn da console, sempre da root
Io sono il detective Arsenio Magret, e porto sempre la camicia TATUATA!
Avatar utente
Blallo
Packager
Packager
 
Messaggi: 3222
Iscritto il: ven ott 12, 2007 10:37
Località: Torino / Torremaggiore (FG)
Nome Cognome: Savino Liguori
Slackware: 14.1 / 12.2
Kernel: 3.12.2-ck
Desktop: Openbox

Re: Elightenment e17 builder - Segnalazioni

Messaggioda erio » mer ago 04, 2010 22:54

è che ero nidificato in una directory,ora sono sulla slackware ed è partito lo script..ci sentiamo domani per gli aggiornamenti,speriamo bene non compilava mai.
erio
Linux 3.x
Linux 3.x
 
Messaggi: 1069
Iscritto il: ven ott 09, 2009 18:25
Slackware: 13.37
Kernel: 3.0.7
Desktop: kde

Re: Elightenment e17 builder - Segnalazioni

Messaggioda erio » mer ago 04, 2010 23:25

ci sentiamo subito:
Codice: Seleziona tutto
917 translated messages, 513 fuzzy translations, 157 untranslated messages.
--- esmart building error log ---
esmart_container.c: In function 'esmart_container_sort':
esmart_container.c:53: warning: passing argument 3 of 'eina_list_sort' from incompatible pointer type
/usr/include/eina-0/eina/eina_list.h:166: note: expected 'Eina_Compare_Cb' but argument is of type 'int (*)(void *, void *)'
esmart_container.c: In function '_container_element_move':
esmart_container.c:630: warning: ignoring return value of 'eina_list_append_relative', declared with attribute warn_unused_result
esmart_container.c:632: warning: ignoring return value of 'eina_list_prepend', declared with attribute warn_unused_result
default.c: In function '_default_scroll_start':
default.c:246: warning: passing argument 2 of 'ecore_timer_add' from incompatible pointer type
/usr/include/ecore-0/Ecore.h:450: note: expected 'Ecore_Task_Cb' but argument is of type 'int (*)(void *)'
engage.c: In function '_engage_scroll_start':
engage.c:316: warning: passing argument 2 of 'ecore_timer_add' from incompatible pointer type
/usr/include/ecore-0/Ecore.h:450: note: expected 'Ecore_Task_Cb' but argument is of type 'int (*)(void *)'
engage.c: In function 'engage_zoom_in':
engage.c:387: warning: passing argument 2 of 'ecore_timer_add' from incompatible pointer type
/usr/include/ecore-0/Ecore.h:450: note: expected 'Ecore_Task_Cb' but argument is of type 'int (*)(void *)'
engage.c: In function 'engage_zoom_out':
engage.c:397: warning: passing argument 2 of 'ecore_timer_add' from incompatible pointer type
/usr/include/ecore-0/Ecore.h:450: note: expected 'Ecore_Task_Cb' but argument is of type 'int (*)(void *)'
entice.c: In function '_entice_scroll_start':
entice.c:231: warning: passing argument 2 of 'ecore_timer_add' from incompatible pointer type
/usr/include/ecore-0/Ecore.h:450: note: expected 'Ecore_Task_Cb' but argument is of type 'int (*)(void *)'
esmart_trans_x11.c: In function '_esmart_trans_x11_property_cb':
esmart_trans_x11.c:452: warning: passing argument 2 of 'ecore_timer_add' from incompatible pointer type
/usr/include/ecore-0/Ecore.h:450: note: expected 'Ecore_Task_Cb' but argument is of type 'int (*)(void *)'
esmart_trans_x11.c: In function '_esmart_trans_x11_smart_get':
esmart_trans_x11.c:495: warning: passing argument 2 of 'ecore_event_handler_add' from incompatible pointer type
/usr/include/ecore-0/Ecore.h:335: note: expected 'Ecore_Event_Handler_Cb' but argument is of type 'int (*)(void *, int,  void *)'
esmart_xpixmap.c: In function '_smart_add':
esmart_xpixmap.c:240: warning: passing argument 2 of 'ecore_event_handler_add' from incompatible pointer type
/usr/include/ecore-0/Ecore.h:335: note: expected 'Ecore_Event_Handler_Cb' but argument is of type 'int (*)(void *, int,  void *)'
esmart_xpixmap.c:242: warning: passing argument 2 of 'ecore_event_handler_add' from incompatible pointer type
/usr/include/ecore-0/Ecore.h:335: note: expected 'Ecore_Event_Handler_Cb' but argument is of type 'int (*)(void *, int,  void *)'
esmart_xpixmap.c:244: warning: passing argument 2 of 'ecore_event_handler_add' from incompatible pointer type
/usr/include/ecore-0/Ecore.h:335: note: expected 'Ecore_Event_Handler_Cb' but argument is of type 'int (*)(void *, int,  void *)'
esmart_xpixmap.c:246: warning: passing argument 2 of 'ecore_event_handler_add' from incompatible pointer type
/usr/include/ecore-0/Ecore.h:335: note: expected 'Ecore_Event_Handler_Cb' but argument is of type 'int (*)(void *, int,  void *)'
esmart_xpixmap.c:248: warning: passing argument 2 of 'ecore_event_handler_add' from incompatible pointer type
/usr/include/ecore-0/Ecore.h:335: note: expected 'Ecore_Event_Handler_Cb' but argument is of type 'int (*)(void *, int,  void *)'
--- eterm building error log ---
misc.c: In function 'str_trim':
misc.c:101: warning: comparison of distinct pointer types lacks a cast
options.c: In function 'save_config':
options.c:3891: warning: pointer type mismatch in conditional expression
sse2_cmod.c: In function 'shade_ximage_15_sse2':
sse2_cmod.c:93: error: can't find a register in class 'BREG' while reloading 'asm'
sse2_cmod.c:93: error: 'asm' operand has impossible constraints
make[2]: *** [sse2_cmod.lo] Error 1
make[2]: *** Waiting for unfinished jobs....
libscream.c:1489:2: warning: #warning compiling in libscream
libscream.c:1495:2: warning: #warning compiling in support for GNU screen
make[1]: *** [all-recursive] Error 1
make: *** [all] Error 2
erio
Linux 3.x
Linux 3.x
 
Messaggi: 1069
Iscritto il: ven ott 09, 2009 18:25
Slackware: 13.37
Kernel: 3.0.7
Desktop: kde

Re: Elightenment e17 builder - Segnalazioni

Messaggioda erio » gio ago 05, 2010 20:48

any hint?
erio
Linux 3.x
Linux 3.x
 
Messaggi: 1069
Iscritto il: ven ott 09, 2009 18:25
Slackware: 13.37
Kernel: 3.0.7
Desktop: kde

Re: Elightenment e17 builder - Segnalazioni

Messaggioda Blallo » gio ago 05, 2010 20:52

aspettiamo un trunk compilabile..purtroppo non so dirti altro :(
Io sono il detective Arsenio Magret, e porto sempre la camicia TATUATA!
Avatar utente
Blallo
Packager
Packager
 
Messaggi: 3222
Iscritto il: ven ott 12, 2007 10:37
Località: Torino / Torremaggiore (FG)
Nome Cognome: Savino Liguori
Slackware: 14.1 / 12.2
Kernel: 3.12.2-ck
Desktop: Openbox

PrecedenteProssimo

Torna a Packages

Chi c’è in linea

Visitano il forum: Google [Bot] e 1 ospite