Repository 32bit  Forum
Repository 64bit  Wiki

Slackware-current..non compila più nulla?

Se avete problemi con l'installazione e la configurazione di Slackware64 postate qui. Non usate questo forum per argomenti che trattano la Slackware32 o generali... per quelli usate rispettivamente il forum Slackware e Gnu/Linux in genere.

Moderatore: Staff

Regole del forum
1) Citare sempre la versione di Slackware64 usata, la versione del Kernel e magari anche la versione della libreria coinvolta. Questi dati aiutano le persone che possono rispondere.
2) Per evitare confusione prego inserire in questo forum solo topic che riguardano appunto Slackware64, se l'argomento è Slackware32 o generale usate rispettivamente il forum Slackware o Gnu/Linux in genere.
3) Leggere attentamente le risposte ricevute
4) Scrivere i messaggi con il colore di default, evitare altri colori.
5) Scrivere in Italiano o in Inglese, se possibile grammaticalmente corretto, evitate stili di scrittura poco chiari, quindi nessuna abbreviazione tipo telegramma o scrittura stile SMS o CHAT.
6) Appena registrati è consigliato presentarsi nel forum dedicato.

La non osservanza delle regole porta a provvedimenti di vari tipo da parte dello staff, in particolare la non osservanza della regola 5 porta alla cancellazione del post e alla segnalazione dell'utente. In caso di recidività l'utente rischia il ban temporaneo.

Slackware-current..non compila più nulla?

Messaggioda Meskalamdug » lun mar 26, 2012 13:04

Nessuna applicazione gtk non compila.
Sto provando apcupsd(che contiene una gui gtk) e l'ultimo amule da git..
uno da questo errore
Codice: Seleziona tutto
/usr/include/glib-2.0/glib/gthread.h: In function 'g_once_init_enter':
/usr/include/glib-2.0/glib/gthread.h:347:3: error: size of unnamed array is negative
  CXX   src/drivers/apcsmart/smartoper.c
  CXX   src/lib/apcerror.c
  CXX   src/drivers/apcsmart/smart.c
make[3]: *** [.obj/eggtrayicon.o] Errore 1
make[2]: *** [all] Errore 2
make[1]: *** [gapcmon_DIR] Errore 2
make[1]: *** Attesa dei processi non terminati....
  CXX   src/drivers/apcsmart/smarteeprom.c
smart.c: In function 'int apcsmart_ups_read_volatile_data(UPSINFO*)':


l'altro

Codice: Seleziona tutto
g++ -W -Wall -Wshadow -Wundef -O2 -pthread   -lpthread  -o amule amule-CaptchaDialog.o amule-CaptchaGenerator.o amule-PartFileConvert.o amule-PartFileConvertDlg.o amule-amule.o amule-BaseClient.o amule-CanceledFileList.o amule-ClientList.o amule-ClientCreditsList.o amule-ClientTCPSocket.o amule-ClientUDPSocket.o amule-CorruptionBlackBox.o amule-DownloadClient.o amule-DownloadQueue.o amule-ECSpecialCoreTags.o amule-EMSocket.o amule-EncryptedStreamSocket.o amule-EncryptedDatagramSocket.o amule-ExternalConn.o amule-FriendList.o amule-IPFilter.o amule-KnownFileList.o amule-ListenSocket.o amule-MuleUDPSocket.o amule-SearchFile.o amule-SearchList.o amule-ServerConnect.o amule-ServerList.o amule-ServerSocket.o amule-ServerUDPSocket.o amule-SHAHashSet.o amule-SharedFileList.o amule-ThreadTasks.o amule-UploadBandwidthThrottler.o amule-UploadClient.o amule-UploadQueue.o amule-Indexed.o amule-Kademlia.o amule-Prefs.o amule-Search.o amule-UDPFirewallTester.o amule-KademliaUDPListener.o amule-PacketTracking.o amule-Contact.o amule-RoutingZone.o amule-amule-gui.o amule-amuleDlg.o amule-AddFriend.o amule-CatDialog.o amule-ChatSelector.o amule-ChatWnd.o amule-CommentDialog.o amule-CommentDialogLst.o amule-GenericClientListCtrl.o amule-ClientDetailDialog.o amule-DirectoryTreeCtrl.o amule-FileDetailDialog.o amule-KadDlg.o amule-OScopeCtrl.o amule-PrefsUnifiedDlg.o amule-SearchDlg.o amule-ServerWnd.o amule-SharedFilesWnd.o amule-StatisticsDlg.o amule-SearchListCtrl.o amule-DownloadListCtrl.o amule-SourceListCtrl.o amule-SharedFilePeersListCtrl.o amule-FriendListCtrl.o amule-ServerListCtrl.o amule-SharedFilesCtrl.o amule-MuleTrayIcon.o amule-TransferWnd.o amule-amuleAppCommon.o amule-ClientRef.o amule-DataToText.o amule-ECSpecialMuleTags.o amule-KnownFile.o amule-GetTickCount.o amule-GuiEvents.o amule-HTTPDownload.o amule-Logger.o amule-PartFile.o amule-Preferences.o amule-Proxy.o amule-Server.o amule-Statistics.o amule-StatTree.o amule-UserEvents.o -L. -lmuleappcommon -Llibs/common -Llibs/ec/cpp -lmulecommon -lec -lbfd -liberty   -lz  -L/usr/lib -lcryptopp -L. -lmuleappcore  -pthread   -lupnp -lthreadutil -lixml    -L. -lmuleappgui -L/usr/lib64 -pthread   -L/usr/X11R6/lib64   -lwx_gtk2u_adv-2.8 -lwx_gtk2u_core-2.8 -lwx_baseu_net-2.8 -lwx_baseu-2.8   -lGeoIP 
/usr/lib64/gcc/x86_64-slackware-linux/4.6.2/../../../../x86_64-slackware-linux/bin/ld: skipping incompatible /usr/lib/libpthread.so when searching for -lpthread
/usr/lib64/gcc/x86_64-slackware-linux/4.6.2/../../../../x86_64-slackware-linux/bin/ld: skipping incompatible /usr/lib/libpthread.a when searching for -lpthread
/usr/lib64/gcc/x86_64-slackware-linux/4.6.2/../../../../x86_64-slackware-linux/bin/ld: skipping incompatible /usr/lib/libz.so when searching for -lz
/usr/lib64/gcc/x86_64-slackware-linux/4.6.2/../../../../x86_64-slackware-linux/bin/ld: skipping incompatible /usr/lib/libz.a when searching for -lz
/usr/lib64/gcc/x86_64-slackware-linux/4.6.2/../../../../x86_64-slackware-linux/bin/ld: skipping incompatible /usr/lib/libwx_gtk2u_adv-2.8.so when searching for -lwx_gtk2u_adv-2.8
/usr/lib64/gcc/x86_64-slackware-linux/4.6.2/../../../../x86_64-slackware-linux/bin/ld: skipping incompatible /usr/lib/libwx_gtk2u_core-2.8.so when searching for -lwx_gtk2u_core-2.8
/usr/lib64/gcc/x86_64-slackware-linux/4.6.2/../../../../x86_64-slackware-linux/bin/ld: skipping incompatible /usr/lib/libwx_baseu_net-2.8.so when searching for -lwx_baseu_net-2.8
/usr/lib64/gcc/x86_64-slackware-linux/4.6.2/../../../../x86_64-slackware-linux/bin/ld: skipping incompatible /usr/lib/libwx_baseu-2.8.so when searching for -lwx_baseu-2.8
/usr/lib64/gcc/x86_64-slackware-linux/4.6.2/../../../../x86_64-slackware-linux/bin/ld: skipping incompatible /usr/lib/libstdc++.so when searching for -lstdc++
/usr/lib64/gcc/x86_64-slackware-linux/4.6.2/../../../../x86_64-slackware-linux/bin/ld: skipping incompatible /usr/lib/libstdc++.a when searching for -lstdc++
/usr/lib64/gcc/x86_64-slackware-linux/4.6.2/../../../../x86_64-slackware-linux/bin/ld: skipping incompatible /usr/lib/libm.so when searching for -lm
/usr/lib64/gcc/x86_64-slackware-linux/4.6.2/../../../../x86_64-slackware-linux/bin/ld: skipping incompatible /usr/lib/libm.a when searching for -lm
/usr/lib64/gcc/x86_64-slackware-linux/4.6.2/../../../../x86_64-slackware-linux/bin/ld: skipping incompatible /usr/lib/libgcc_s.so when searching for -lgcc_s
/usr/lib64/gcc/x86_64-slackware-linux/4.6.2/../../../../x86_64-slackware-linux/bin/ld: skipping incompatible /usr/lib/libpthread.so when searching for -lpthread
/usr/lib64/gcc/x86_64-slackware-linux/4.6.2/../../../../x86_64-slackware-linux/bin/ld: skipping incompatible /usr/lib/libpthread.a when searching for -lpthread
/usr/lib64/gcc/x86_64-slackware-linux/4.6.2/../../../../x86_64-slackware-linux/bin/ld: skipping incompatible /usr/lib/libc.so when searching for -lc
/usr/lib64/gcc/x86_64-slackware-linux/4.6.2/../../../../x86_64-slackware-linux/bin/ld: skipping incompatible /usr/lib/libc.a when searching for -lc
/usr/lib64/gcc/x86_64-slackware-linux/4.6.2/../../../../x86_64-slackware-linux/bin/ld: skipping incompatible /usr/lib/libgcc_s.so when searching for -lgcc_s
`.text._ZN8CryptoPP14InputRejectingINS_22BufferedTransformationEED2Ev' referenced in section `.text._ZN8CryptoPP14InputRejectingINS_22BufferedTransformationEED1Ev[non-virtual thunk to CryptoPP::InputRejecting<CryptoPP::BufferedTransformation>::~InputRejecting()]' of /usr/lib64/libcryptopp.a(files.o): defined in discarded section `.text._ZN8CryptoPP14InputRejectingINS_22BufferedTransformationEED2Ev[_ZN8CryptoPP14InputRejectingINS_22BufferedTransformationEED5Ev]' of /usr/lib64/libcryptopp.a(files.o)
`.text._ZN8CryptoPP13AutoSignalingINS_14InputRejectingINS_22BufferedTransformationEEEED2Ev' referenced in section `.text._ZN8CryptoPP13AutoSignalingINS_14InputRejectingINS_22BufferedTransformationEEEED1Ev[non-virtual thunk to CryptoPP::AutoSignaling<CryptoPP::InputRejecting<CryptoPP::BufferedTransformation> >::~AutoSignaling()]' of /usr/lib64/libcryptopp.a(files.o): defined in discarded section `.text._ZN8CryptoPP13AutoSignalingINS_14InputRejectingINS_22BufferedTransformationEEEED2Ev[_ZN8CryptoPP13AutoSignalingINS_14InputRejectingINS_22BufferedTransformationEEEED5Ev]' of /usr/lib64/libcryptopp.a(files.o)
`.text._ZN8CryptoPP4SinkD2Ev' referenced in section `.text._ZN8CryptoPP4SinkD1Ev[non-virtual thunk to CryptoPP::Sink::~Sink()]' of /usr/lib64/libcryptopp.a(files.o): defined in discarded section `.text._ZN8CryptoPP4SinkD2Ev[_ZN8CryptoPP4SinkD5Ev]' of /usr/lib64/libcryptopp.a(files.o)
`.text._ZN8CryptoPP14InputRejectingINS_6FilterEED2Ev' referenced in section `.text._ZN8CryptoPP14InputRejectingINS_6FilterEED1Ev[non-virtual thunk to CryptoPP::InputRejecting<CryptoPP::Filter>::~InputRejecting()]' of /usr/lib64/libcryptopp.a(files.o): defined in discarded section `.text._ZN8CryptoPP14InputRejectingINS_6FilterEED2Ev[_ZN8CryptoPP14InputRejectingINS_6FilterEED5Ev]' of /usr/lib64/libcryptopp.a(files.o)
`.text._ZN8CryptoPP6FilterD2Ev' referenced in section `.text._ZN8CryptoPP6FilterD1Ev[non-virtual thunk to CryptoPP::Filter::~Filter()]' of /usr/lib64/libcryptopp.a(files.o): defined in discarded section `.text._ZN8CryptoPP6FilterD2Ev[_ZN8CryptoPP6FilterD5Ev]' of /usr/lib64/libcryptopp.a(files.o)
`.text._ZN8CryptoPP6SourceD2Ev' referenced in section `.text._ZN8CryptoPP6SourceD1Ev[non-virtual thunk to CryptoPP::Source::~Source()]' of /usr/lib64/libcryptopp.a(files.o): defined in discarded section `.text._ZN8CryptoPP6SourceD2Ev[_ZN8CryptoPP6SourceD5Ev]' of /usr/lib64/libcryptopp.a(files.o)
`.text._ZN8CryptoPP14SourceTemplateINS_9FileStoreEED2Ev' referenced in section `.text._ZN8CryptoPP14SourceTemplateINS_9FileStoreEED1Ev[non-virtual thunk to CryptoPP::SourceTemplate<CryptoPP::FileStore>::~SourceTemplate()]' of /usr/lib64/libcryptopp.a(files.o): defined in discarded section `.text._ZN8CryptoPP14SourceTemplateINS_9FileStoreEED2Ev[_ZN8CryptoPP14SourceTemplateINS_9FileStoreEED5Ev]' of /usr/lib64/libcryptopp.a(files.o)
`.text._ZN8CryptoPP10FileSourceD2Ev' referenced in section `.text._ZN8CryptoPP10FileSourceD1Ev[non-virtual thunk to CryptoPP::FileSource::~FileSource()]' of /usr/lib64/libcryptopp.a(files.o): defined in discarded section `.text._ZN8CryptoPP10FileSourceD2Ev[_ZN8CryptoPP10FileSourceD5Ev]' of /usr/lib64/libcryptopp.a(files.o)
`.text._ZN8CryptoPP10BufferlessINS_4SinkEED2Ev' referenced in section `.text._ZN8CryptoPP10BufferlessINS_4SinkEED1Ev[non-virtual thunk to CryptoPP::Bufferless<CryptoPP::Sink>::~Bufferless()]' of /usr/lib64/libcryptopp.a(queue.o): defined in discarded section `.text._ZN8CryptoPP10BufferlessINS_4SinkEED2Ev[_ZN8CryptoPP10BufferlessINS_4SinkEED5Ev]' of /usr/lib64/libcryptopp.a(queue.o)
`.text._ZN8CryptoPP22TF_SignatureSchemeBaseINS_11PK_VerifierENS_7TF_BaseINS_16TrapdoorFunctionENS_33PK_SignatureMessageEncodingMethodEEEED2Ev' referenced in section `.text._ZN8CryptoPP22TF_SignatureSchemeBaseINS_11PK_VerifierENS_7TF_BaseINS_16TrapdoorFunctionENS_33PK_SignatureMessageEncodingMethodEEEED1Ev[non-virtual thunk to CryptoPP::TF_SignatureSchemeBase<CryptoPP::PK_Verifier, CryptoPP::TF_Base<CryptoPP::TrapdoorFunction, CryptoPP::PK_SignatureMessageEncodingMethod> >::~TF_SignatureSchemeBase()]' of /usr/lib64/libcryptopp.a(pubkey.o): defined in discarded section `.text._ZN8CryptoPP22TF_SignatureSchemeBaseINS_11PK_VerifierENS_7TF_BaseINS_16TrapdoorFunctionENS_33PK_SignatureMessageEncodingMethodEEEED2Ev[_ZN8CryptoPP22TF_SignatureSchemeBaseINS_11PK_VerifierENS_7TF_BaseINS_16TrapdoorFunctionENS_33PK_SignatureMessageEncodingMethodEEEED5Ev]' of /usr/lib64/libcryptopp.a(pubkey.o)
`.text._ZN8CryptoPP22TF_SignatureSchemeBaseINS_9PK_SignerENS_7TF_BaseINS_33RandomizedTrapdoorFunctionInverseENS_33PK_SignatureMessageEncodingMethodEEEED2Ev' referenced in section `.text._ZN8CryptoPP22TF_SignatureSchemeBaseINS_9PK_SignerENS_7TF_BaseINS_33RandomizedTrapdoorFunctionInverseENS_33PK_SignatureMessageEncodingMethodEEEED1Ev[non-virtual thunk to CryptoPP::TF_SignatureSchemeBase<CryptoPP::PK_Signer, CryptoPP::TF_Base<CryptoPP::RandomizedTrapdoorFunctionInverse, CryptoPP::PK_SignatureMessageEncodingMethod> >::~TF_SignatureSchemeBase()]' of /usr/lib64/libcryptopp.a(pubkey.o): defined in discarded section `.text._ZN8CryptoPP22TF_SignatureSchemeBaseINS_9PK_SignerENS_7TF_BaseINS_33RandomizedTrapdoorFunctionInverseENS_33PK_SignatureMessageEncodingMethodEEEED2Ev[_ZN8CryptoPP22TF_SignatureSchemeBaseINS_9PK_SignerENS_7TF_BaseINS_33RandomizedTrapdoorFunctionInverseENS_33PK_SignatureMessageEncodingMethodEEEED5Ev]' of /usr/lib64/libcryptopp.a(pubkey.o)
`.text._ZN8CryptoPP10BufferlessINS_6FilterEED2Ev' referenced in section `.text._ZN8CryptoPP10BufferlessINS_6FilterEED1Ev[non-virtual thunk to CryptoPP::Bufferless<CryptoPP::Filter>::~Bufferless()]' of /usr/lib64/libcryptopp.a(pubkey.o): defined in discarded section `.text._ZN8CryptoPP10BufferlessINS_6FilterEED2Ev[_ZN8CryptoPP10BufferlessINS_6FilterEED5Ev]' of /usr/lib64/libcryptopp.a(pubkey.o)
`.text._ZN8CryptoPP23FilterWithBufferedInputD2Ev' referenced in section `.text._ZN8CryptoPP23FilterWithBufferedInputD1Ev[non-virtual thunk to CryptoPP::FilterWithBufferedInput::~FilterWithBufferedInput()]' of /usr/lib64/libcryptopp.a(base64.o): defined in discarded section `.text._ZN8CryptoPP23FilterWithBufferedInputD2Ev[_ZN8CryptoPP23FilterWithBufferedInputD5Ev]' of /usr/lib64/libcryptopp.a(base64.o)
`.text._ZN8CryptoPP17SimpleProxyFilterD2Ev' referenced in section `.text._ZN8CryptoPP17SimpleProxyFilterD1Ev[non-virtual thunk to CryptoPP::SimpleProxyFilter::~SimpleProxyFilter()]' of /usr/lib64/libcryptopp.a(base64.o): defined in discarded section `.text._ZN8CryptoPP17SimpleProxyFilterD2Ev[_ZN8CryptoPP17SimpleProxyFilterD5Ev]' of /usr/lib64/libcryptopp.a(base64.o)
`.text._ZN8CryptoPP11UnflushableINS_6FilterEED2Ev' referenced in section `.text._ZN8CryptoPP11UnflushableINS_6FilterEED1Ev[non-virtual thunk to CryptoPP::Unflushable<CryptoPP::Filter>::~Unflushable()]' of /usr/lib64/libcryptopp.a(basecode.o): defined in discarded section `.text._ZN8CryptoPP11UnflushableINS_6FilterEED2Ev[_ZN8CryptoPP11UnflushableINS_6FilterEED5Ev]' of /usr/lib64/libcryptopp.a(basecode.o)
`.text._ZN8CryptoPP11BlockCipherD2Ev' referenced in section `.text._ZN8CryptoPP11BlockCipherD1Ev[non-virtual thunk to CryptoPP::BlockCipher::~BlockCipher()]' of /usr/lib64/libcryptopp.a(des.o): defined in discarded section `.text._ZN8CryptoPP11BlockCipherD2Ev[_ZN8CryptoPP11BlockCipherD5Ev]' of /usr/lib64/libcryptopp.a(des.o)
`.text._ZN8CryptoPP8TwoBasesINS_11BlockCipherENS_13DES_EDE3_InfoEED2Ev' referenced in section `.text._ZN8CryptoPP8TwoBasesINS_11BlockCipherENS_13DES_EDE3_InfoEED1Ev[non-virtual thunk to CryptoPP::TwoBases<CryptoPP::BlockCipher, CryptoPP::DES_EDE3_Info>::~TwoBases()]' of /usr/lib64/libcryptopp.a(des.o): defined in discarded section `.text._ZN8CryptoPP8TwoBasesINS_11BlockCipherENS_13DES_EDE3_InfoEED2Ev[_ZN8CryptoPP8TwoBasesINS_11BlockCipherENS_13DES_EDE3_InfoEED5Ev]' of /usr/lib64/libcryptopp.a(des.o)
`.text._ZN8CryptoPP25SimpleKeyingInterfaceImplINS_8TwoBasesINS_11BlockCipherENS_13DES_EDE3_InfoEEES4_ED2Ev' referenced in section `.text._ZN8CryptoPP25SimpleKeyingInterfaceImplINS_8TwoBasesINS_11BlockCipherENS_13DES_EDE3_InfoEEES4_ED1Ev[non-virtual thunk to CryptoPP::SimpleKeyingInterfaceImpl<CryptoPP::TwoBases<CryptoPP::BlockCipher, CryptoPP::DES_EDE3_Info>, CryptoPP::TwoBases<CryptoPP::BlockCipher, CryptoPP::DES_EDE3_Info> >::~SimpleKeyingInterfaceImpl()]' of /usr/lib64/libcryptopp.a(des.o): defined in discarded section `.text._ZN8CryptoPP25SimpleKeyingInterfaceImplINS_8TwoBasesINS_11BlockCipherENS_13DES_EDE3_InfoEEES4_ED2Ev[_ZN8CryptoPP25SimpleKeyingInterfaceImplINS_8TwoBasesINS_11BlockCipherENS_13DES_EDE3_InfoEEES4_ED5Ev]' of /usr/lib64/libcryptopp.a(des.o)
`.text._ZN8CryptoPP13AlgorithmImplINS_25SimpleKeyingInterfaceImplINS_8TwoBasesINS_11BlockCipherENS_13DES_EDE3_InfoEEES5_EES6_ED2Ev' referenced in section `.text._ZN8CryptoPP13AlgorithmImplINS_25SimpleKeyingInterfaceImplINS_8TwoBasesINS_11BlockCipherENS_13DES_EDE3_InfoEEES5_EES6_ED1Ev[non-virtual thunk to CryptoPP::AlgorithmImpl<CryptoPP::SimpleKeyingInterfaceImpl<CryptoPP::TwoBases<CryptoPP::BlockCipher, CryptoPP::DES_EDE3_Info>, CryptoPP::TwoBases<CryptoPP::BlockCipher, CryptoPP::DES_EDE3_Info> >, CryptoPP::SimpleKeyingInterfaceImpl<CryptoPP::TwoBases<CryptoPP::BlockCipher, CryptoPP::DES_EDE3_Info>, CryptoPP::TwoBases<CryptoPP::BlockCipher, CryptoPP::DES_EDE3_Info> > >::~AlgorithmImpl()]' of /usr/lib64/libcryptopp.a(des.o): defined in discarded section `.text._ZN8CryptoPP13AlgorithmImplINS_25SimpleKeyingInterfaceImplINS_8TwoBasesINS_11BlockCipherENS_13DES_EDE3_InfoEEES5_EES6_ED2Ev[_ZN8CryptoPP13AlgorithmImplINS_25SimpleKeyingInterfaceImplINS_8TwoBasesINS_11BlockCipherENS_13DES_EDE3_InfoEEES5_EES6_ED5Ev]' of /usr/lib64/libcryptopp.a(des.o)
`.text._ZN8CryptoPP15BlockCipherImplINS_13DES_EDE3_InfoENS_11BlockCipherEED2Ev' referenced in section `.text._ZN8CryptoPP15BlockCipherImplINS_13DES_EDE3_InfoENS_11BlockCipherEED1Ev[non-virtual thunk to CryptoPP::BlockCipherImpl<CryptoPP::DES_EDE3_Info, CryptoPP::BlockCipher>::~BlockCipherImpl()]' of /usr/lib64/libcryptopp.a(des.o): defined in discarded section `.text._ZN8CryptoPP15BlockCipherImplINS_13DES_EDE3_InfoENS_11BlockCipherEED2Ev[_ZN8CryptoPP15BlockCipherImplINS_13DES_EDE3_InfoENS_11BlockCipherEED5Ev]' of /usr/lib64/libcryptopp.a(des.o)
`.text._ZN8CryptoPP14SourceTemplateINS_11StringStoreEED2Ev' referenced in section `.text._ZN8CryptoPP14SourceTemplateINS_11StringStoreEED1Ev[non-virtual thunk to CryptoPP::SourceTemplate<CryptoPP::StringStore>::~SourceTemplate()]' of /usr/lib64/libcryptopp.a(dll.o): defined in discarded section `.text._ZN8CryptoPP14SourceTemplateINS_11StringStoreEED2Ev[_ZN8CryptoPP14SourceTemplateINS_11StringStoreEED5Ev]' of /usr/lib64/libcryptopp.a(dll.o)
`.text._ZN8CryptoPP12StringSourceD2Ev' referenced in section `.text._ZN8CryptoPP12StringSourceD1Ev[non-virtual thunk to CryptoPP::StringSource::~StringSource()]' of /usr/lib64/libcryptopp.a(dll.o): defined in discarded section `.text._ZN8CryptoPP12StringSourceD2Ev[_ZN8CryptoPP12StringSourceD5Ev]' of /usr/lib64/libcryptopp.a(dll.o)
`.text._ZN8CryptoPP13AlgorithmImplINS_13TF_SignerBaseENS_5TF_SSINS_8PKCS1v15ENS_4SHA1ENS_3RSAEiEEED2Ev' referenced in section `.text._ZN8CryptoPP13AlgorithmImplINS_13TF_SignerBaseENS_5TF_SSINS_8PKCS1v15ENS_4SHA1ENS_3RSAEiEEED1Ev[non-virtual thunk to CryptoPP::AlgorithmImpl<CryptoPP::TF_SignerBase, CryptoPP::TF_SS<CryptoPP::PKCS1v15, CryptoPP::SHA1, CryptoPP::RSA, int> >::~AlgorithmImpl()]' of /usr/lib64/libcryptopp.a(rsa.o): defined in discarded section `.text._ZN8CryptoPP13AlgorithmImplINS_13TF_SignerBaseENS_5TF_SSINS_8PKCS1v15ENS_4SHA1ENS_3RSAEiEEED2Ev[_ZN8CryptoPP13AlgorithmImplINS_13TF_SignerBaseENS_5TF_SSINS_8PKCS1v15ENS_4SHA1ENS_3RSAEiEEED5Ev]' of /usr/lib64/libcryptopp.a(rsa.o)
`.text._ZN8CryptoPP17TF_ObjectImplBaseINS_13TF_SignerBaseENS_25TF_SignatureSchemeOptionsINS_5TF_SSINS_8PKCS1v15ENS_4SHA1ENS_3RSAEiEES6_NS_39PKCS1v15_SignatureMessageEncodingMethodES5_EENS_21InvertibleRSAFunctionEED2Ev' referenced in section `.text._ZN8CryptoPP17TF_ObjectImplBaseINS_13TF_SignerBaseENS_25TF_SignatureSchemeOptionsINS_5TF_SSINS_8PKCS1v15ENS_4SHA1ENS_3RSAEiEES6_NS_39PKCS1v15_SignatureMessageEncodingMethodES5_EENS_21InvertibleRSAFunctionEED1Ev[non-virtual thunk to CryptoPP::TF_ObjectImplBase<CryptoPP::TF_SignerBase, CryptoPP::TF_SignatureSchemeOptions<CryptoPP::TF_SS<CryptoPP::PKCS1v15, CryptoPP::SHA1, CryptoPP::RSA, int>, CryptoPP::RSA, CryptoPP::PKCS1v15_SignatureMessageEncodingMethod, CryptoPP::SHA1>, CryptoPP::InvertibleRSAFunction>::~TF_ObjectImplBase()]' of /usr/lib64/libcryptopp.a(rsa.o): defined in discarded section `.text._ZN8CryptoPP17TF_ObjectImplBaseINS_13TF_SignerBaseENS_25TF_SignatureSchemeOptionsINS_5TF_SSINS_8PKCS1v15ENS_4SHA1ENS_3RSAEiEES6_NS_39PKCS1v15_SignatureMessageEncodingMethodES5_EENS_21InvertibleRSAFunctionEED2Ev[_ZN8CryptoPP17TF_ObjectImplBaseINS_13TF_SignerBaseENS_25TF_SignatureSchemeOptionsINS_5TF_SSINS_8PKCS1v15ENS_4SHA1ENS_3RSAEiEES6_NS_39PKCS1v15_SignatureMessageEncodingMethodES5_EENS_21InvertibleRSAFunctionEED5Ev]' of /usr/lib64/libcryptopp.a(rsa.o)
`.text._ZN8CryptoPP13AlgorithmImplINS_15TF_VerifierBaseENS_5TF_SSINS_8PKCS1v15ENS_4SHA1ENS_3RSAEiEEED2Ev' referenced in section `.text._ZN8CryptoPP13AlgorithmImplINS_15TF_VerifierBaseENS_5TF_SSINS_8PKCS1v15ENS_4SHA1ENS_3RSAEiEEED1Ev[non-virtual thunk to CryptoPP::AlgorithmImpl<CryptoPP::TF_VerifierBase, CryptoPP::TF_SS<CryptoPP::PKCS1v15, CryptoPP::SHA1, CryptoPP::RSA, int> >::~AlgorithmImpl()]' of /usr/lib64/libcryptopp.a(rsa.o): defined in discarded section `.text._ZN8CryptoPP13AlgorithmImplINS_15TF_VerifierBaseENS_5TF_SSINS_8PKCS1v15ENS_4SHA1ENS_3RSAEiEEED2Ev[_ZN8CryptoPP13AlgorithmImplINS_15TF_VerifierBaseENS_5TF_SSINS_8PKCS1v15ENS_4SHA1ENS_3RSAEiEEED5Ev]' of /usr/lib64/libcryptopp.a(rsa.o)
`.text._ZN8CryptoPP17TF_ObjectImplBaseINS_15TF_VerifierBaseENS_25TF_SignatureSchemeOptionsINS_5TF_SSINS_8PKCS1v15ENS_4SHA1ENS_3RSAEiEES6_NS_39PKCS1v15_SignatureMessageEncodingMethodES5_EENS_11RSAFunctionEED2Ev' referenced in section `.text._ZN8CryptoPP17TF_ObjectImplBaseINS_15TF_VerifierBaseENS_25TF_SignatureSchemeOptionsINS_5TF_SSINS_8PKCS1v15ENS_4SHA1ENS_3RSAEiEES6_NS_39PKCS1v15_SignatureMessageEncodingMethodES5_EENS_11RSAFunctionEED1Ev[non-virtual thunk to CryptoPP::TF_ObjectImplBase<CryptoPP::TF_VerifierBase, CryptoPP::TF_SignatureSchemeOptions<CryptoPP::TF_SS<CryptoPP::PKCS1v15, CryptoPP::SHA1, CryptoPP::RSA, int>, CryptoPP::RSA, CryptoPP::PKCS1v15_SignatureMessageEncodingMethod, CryptoPP::SHA1>, CryptoPP::RSAFunction>::~TF_ObjectImplBase()]' of /usr/lib64/libcryptopp.a(rsa.o): defined in discarded section `.text._ZN8CryptoPP17TF_ObjectImplBaseINS_15TF_VerifierBaseENS_25TF_SignatureSchemeOptionsINS_5TF_SSINS_8PKCS1v15ENS_4SHA1ENS_3RSAEiEES6_NS_39PKCS1v15_SignatureMessageEncodingMethodES5_EENS_11RSAFunctionEED2Ev[_ZN8CryptoPP17TF_ObjectImplBaseINS_15TF_VerifierBaseENS_25TF_SignatureSchemeOptionsINS_5TF_SSINS_8PKCS1v15ENS_4SHA1ENS_3RSAEiEES6_NS_39PKCS1v15_SignatureMessageEncodingMethodES5_EENS_11RSAFunctionEED5Ev]' of /usr/lib64/libcryptopp.a(rsa.o)
`.text._ZN8CryptoPP13TF_ObjectImplINS_15TF_VerifierBaseENS_25TF_SignatureSchemeOptionsINS_5TF_SSINS_8PKCS1v15ENS_4SHA1ENS_3RSAEiEES6_NS_39PKCS1v15_SignatureMessageEncodingMethodES5_EENS_11RSAFunctionEED2Ev' referenced in section `.text._ZN8CryptoPP13TF_ObjectImplINS_15TF_VerifierBaseENS_25TF_SignatureSchemeOptionsINS_5TF_SSINS_8PKCS1v15ENS_4SHA1ENS_3RSAEiEES6_NS_39PKCS1v15_SignatureMessageEncodingMethodES5_EENS_11RSAFunctionEED1Ev[non-virtual thunk to CryptoPP::TF_ObjectImpl<CryptoPP::TF_VerifierBase, CryptoPP::TF_SignatureSchemeOptions<CryptoPP::TF_SS<CryptoPP::PKCS1v15, CryptoPP::SHA1, CryptoPP::RSA, int>, CryptoPP::RSA, CryptoPP::PKCS1v15_SignatureMessageEncodingMethod, CryptoPP::SHA1>, CryptoPP::RSAFunction>::~TF_ObjectImpl()]' of /usr/lib64/libcryptopp.a(rsa.o): defined in discarded section `.text._ZN8CryptoPP13TF_ObjectImplINS_15TF_VerifierBaseENS_25TF_SignatureSchemeOptionsINS_5TF_SSINS_8PKCS1v15ENS_4SHA1ENS_3RSAEiEES6_NS_39PKCS1v15_SignatureMessageEncodingMethodES5_EENS_11RSAFunctionEED2Ev[_ZN8CryptoPP13TF_ObjectImplINS_15TF_VerifierBaseENS_25TF_SignatureSchemeOptionsINS_5TF_SSINS_8PKCS1v15ENS_4SHA1ENS_3RSAEiEES6_NS_39PKCS1v15_SignatureMessageEncodingMethodES5_EENS_11RSAFunctionEED5Ev]' of /usr/lib64/libcryptopp.a(rsa.o)
`.text._ZN8CryptoPP15TF_VerifierImplINS_25TF_SignatureSchemeOptionsINS_5TF_SSINS_8PKCS1v15ENS_4SHA1ENS_3RSAEiEES5_NS_39PKCS1v15_SignatureMessageEncodingMethodES4_EEED2Ev' referenced in section `.text._ZN8CryptoPP15TF_VerifierImplINS_25TF_SignatureSchemeOptionsINS_5TF_SSINS_8PKCS1v15ENS_4SHA1ENS_3RSAEiEES5_NS_39PKCS1v15_SignatureMessageEncodingMethodES4_EEED1Ev[non-virtual thunk to CryptoPP::TF_VerifierImpl<CryptoPP::TF_SignatureSchemeOptions<CryptoPP::TF_SS<CryptoPP::PKCS1v15, CryptoPP::SHA1, CryptoPP::RSA, int>, CryptoPP::RSA, CryptoPP::PKCS1v15_SignatureMessageEncodingMethod, CryptoPP::SHA1> >::~TF_VerifierImpl()]' of /usr/lib64/libcryptopp.a(rsa.o): defined in discarded section `.text._ZN8CryptoPP15TF_VerifierImplINS_25TF_SignatureSchemeOptionsINS_5TF_SSINS_8PKCS1v15ENS_4SHA1ENS_3RSAEiEES5_NS_39PKCS1v15_SignatureMessageEncodingMethodES4_EEED2Ev[_ZN8CryptoPP15TF_VerifierImplINS_25TF_SignatureSchemeOptionsINS_5TF_SSINS_8PKCS1v15ENS_4SHA1ENS_3RSAEiEES5_NS_39PKCS1v15_SignatureMessageEncodingMethodES4_EEED5Ev]' of /usr/lib64/libcryptopp.a(rsa.o)
`.text._ZN8CryptoPP16PK_FinalTemplateINS_15TF_VerifierImplINS_25TF_SignatureSchemeOptionsINS_5TF_SSINS_8PKCS1v15ENS_4SHA1ENS_3RSAEiEES6_NS_39PKCS1v15_SignatureMessageEncodingMethodES5_EEEEED2Ev' referenced in section `.text._ZN8CryptoPP16PK_FinalTemplateINS_15TF_VerifierImplINS_25TF_SignatureSchemeOptionsINS_5TF_SSINS_8PKCS1v15ENS_4SHA1ENS_3RSAEiEES6_NS_39PKCS1v15_SignatureMessageEncodingMethodES5_EEEEED1Ev[non-virtual thunk to CryptoPP::PK_FinalTemplate<CryptoPP::TF_VerifierImpl<CryptoPP::TF_SignatureSchemeOptions<CryptoPP::TF_SS<CryptoPP::PKCS1v15, CryptoPP::SHA1, CryptoPP::RSA, int>, CryptoPP::RSA, CryptoPP::PKCS1v15_SignatureMessageEncodingMethod, CryptoPP::SHA1> > >::~PK_FinalTemplate()]' of /usr/lib64/libcryptopp.a(rsa.o): defined in discarded section `.text._ZN8CryptoPP16PK_FinalTemplateINS_15TF_VerifierImplINS_25TF_SignatureSchemeOptionsINS_5TF_SSINS_8PKCS1v15ENS_4SHA1ENS_3RSAEiEES6_NS_39PKCS1v15_SignatureMessageEncodingMethodES5_EEEEED2Ev[_ZN8CryptoPP16PK_FinalTemplateINS_15TF_VerifierImplINS_25TF_SignatureSchemeOptionsINS_5TF_SSINS_8PKCS1v15ENS_4SHA1ENS_3RSAEiEES6_NS_39PKCS1v15_SignatureMessageEncodingMethodES5_EEEEED5Ev]' of /usr/lib64/libcryptopp.a(rsa.o)
`.text._ZN8CryptoPP13TF_ObjectImplINS_13TF_SignerBaseENS_25TF_SignatureSchemeOptionsINS_5TF_SSINS_8PKCS1v15ENS_4SHA1ENS_3RSAEiEES6_NS_39PKCS1v15_SignatureMessageEncodingMethodES5_EENS_21InvertibleRSAFunctionEED2Ev' referenced in section `.text._ZN8CryptoPP13TF_ObjectImplINS_13TF_SignerBaseENS_25TF_SignatureSchemeOptionsINS_5TF_SSINS_8PKCS1v15ENS_4SHA1ENS_3RSAEiEES6_NS_39PKCS1v15_SignatureMessageEncodingMethodES5_EENS_21InvertibleRSAFunctionEED1Ev[non-virtual thunk to CryptoPP::TF_ObjectImpl<CryptoPP::TF_SignerBase, CryptoPP::TF_SignatureSchemeOptions<CryptoPP::TF_SS<CryptoPP::PKCS1v15, CryptoPP::SHA1, CryptoPP::RSA, int>, CryptoPP::RSA, CryptoPP::PKCS1v15_SignatureMessageEncodingMethod, CryptoPP::SHA1>, CryptoPP::InvertibleRSAFunction>::~TF_ObjectImpl()]' of /usr/lib64/libcryptopp.a(rsa.o): defined in discarded section `.text._ZN8CryptoPP13TF_ObjectImplINS_13TF_SignerBaseENS_25TF_SignatureSchemeOptionsINS_5TF_SSINS_8PKCS1v15ENS_4SHA1ENS_3RSAEiEES6_NS_39PKCS1v15_SignatureMessageEncodingMethodES5_EENS_21InvertibleRSAFunctionEED2Ev[_ZN8CryptoPP13TF_ObjectImplINS_13TF_SignerBaseENS_25TF_SignatureSchemeOptionsINS_5TF_SSINS_8PKCS1v15ENS_4SHA1ENS_3RSAEiEES6_NS_39PKCS1v15_SignatureMessageEncodingMethodES5_EENS_21InvertibleRSAFunctionEED5Ev]' of /usr/lib64/libcryptopp.a(rsa.o)
`.text._ZN8CryptoPP13TF_SignerImplINS_25TF_SignatureSchemeOptionsINS_5TF_SSINS_8PKCS1v15ENS_4SHA1ENS_3RSAEiEES5_NS_39PKCS1v15_SignatureMessageEncodingMethodES4_EEED2Ev' referenced in section `.text._ZN8CryptoPP13TF_SignerImplINS_25TF_SignatureSchemeOptionsINS_5TF_SSINS_8PKCS1v15ENS_4SHA1ENS_3RSAEiEES5_NS_39PKCS1v15_SignatureMessageEncodingMethodES4_EEED1Ev[non-virtual thunk to CryptoPP::TF_SignerImpl<CryptoPP::TF_SignatureSchemeOptions<CryptoPP::TF_SS<CryptoPP::PKCS1v15, CryptoPP::SHA1, CryptoPP::RSA, int>, CryptoPP::RSA, CryptoPP::PKCS1v15_SignatureMessageEncodingMethod, CryptoPP::SHA1> >::~TF_SignerImpl()]' of /usr/lib64/libcryptopp.a(rsa.o): defined in discarded section `.text._ZN8CryptoPP13TF_SignerImplINS_25TF_SignatureSchemeOptionsINS_5TF_SSINS_8PKCS1v15ENS_4SHA1ENS_3RSAEiEES5_NS_39PKCS1v15_SignatureMessageEncodingMethodES4_EEED2Ev[_ZN8CryptoPP13TF_SignerImplINS_25TF_SignatureSchemeOptionsINS_5TF_SSINS_8PKCS1v15ENS_4SHA1ENS_3RSAEiEES5_NS_39PKCS1v15_SignatureMessageEncodingMethodES4_EEED5Ev]' of /usr/lib64/libcryptopp.a(rsa.o)
`.text._ZN8CryptoPP16PK_FinalTemplateINS_13TF_SignerImplINS_25TF_SignatureSchemeOptionsINS_5TF_SSINS_8PKCS1v15ENS_4SHA1ENS_3RSAEiEES6_NS_39PKCS1v15_SignatureMessageEncodingMethodES5_EEEEED2Ev' referenced in section `.text._ZN8CryptoPP16PK_FinalTemplateINS_13TF_SignerImplINS_25TF_SignatureSchemeOptionsINS_5TF_SSINS_8PKCS1v15ENS_4SHA1ENS_3RSAEiEES6_NS_39PKCS1v15_SignatureMessageEncodingMethodES5_EEEEED1Ev[non-virtual thunk to CryptoPP::PK_FinalTemplate<CryptoPP::TF_SignerImpl<CryptoPP::TF_SignatureSchemeOptions<CryptoPP::TF_SS<CryptoPP::PKCS1v15, CryptoPP::SHA1, CryptoPP::RSA, int>, CryptoPP::RSA, CryptoPP::PKCS1v15_SignatureMessageEncodingMethod, CryptoPP::SHA1> > >::~PK_FinalTemplate()]' of /usr/lib64/libcryptopp.a(rsa.o): defined in discarded section `.text._ZN8CryptoPP16PK_FinalTemplateINS_13TF_SignerImplINS_25TF_SignatureSchemeOptionsINS_5TF_SSINS_8PKCS1v15ENS_4SHA1ENS_3RSAEiEES6_NS_39PKCS1v15_SignatureMessageEncodingMethodES5_EEEEED2Ev[_ZN8CryptoPP16PK_FinalTemplateINS_13TF_SignerImplINS_25TF_SignatureSchemeOptionsINS_5TF_SSINS_8PKCS1v15ENS_4SHA1ENS_3RSAEiEES6_NS_39PKCS1v15_SignatureMessageEncodingMethodES5_EEEEED5Ev]' of /usr/lib64/libcryptopp.a(rsa.o)
collect2: ld returned 1 exit status
make[2]: *** [amule] Errore 1
make[2]: Leaving directory `/tmp/buildpkgs/amule/amule/src'
make[1]: *** [install-recursive] Errore 1
make[1]: Leaving directory `/tmp/buildpkgs/amule/amule/src'
make: *** [install-recursive] Errore 1


È un po di tempo che su current non compilo nulla di gtk..
:(
Meskalamdug
Iper Master
Iper Master
 
Messaggi: 3583
Iscritto il: gio mag 13, 2004 23:00

Re: Slackware-current..non compila più nulla?

Messaggioda hashbang » lun mar 26, 2012 13:13

Ho visto l'aggiornamento di glibc sulla -current, quindi potrebbe essere una incompatibilità delle librerie, compilate per una versione precedente della libc.

Ciò che mi suona strano è questo
Codice: Seleziona tutto
/usr/lib64/gcc/x86_64-slackware-linux/4.6.2/../../../../x86_64-slackware-linux/bin/ld: skipping incompatible /usr/lib/libpthread.so when searching for -lpthread
/usr/lib64/gcc/x86_64-slackware-linux/4.6.2/../../../../x86_64-slackware-linux/bin/ld: skipping incompatible /usr/lib/libpthread.a when searching for -lpthread
/usr/lib64/gcc/x86_64-slackware-linux/4.6.2/../../../../x86_64-slackware-linux/bin/ld: skipping incompatible /usr/lib/libz.so when searching for -lz
/usr/lib64/gcc/x86_64-slackware-linux/4.6.2/../../../../x86_64-slackware-linux/bin/ld: skipping incompatible /usr/lib/libz.a when searching for -lz
/usr/lib64/gcc/x86_64-slackware-linux/4.6.2/../../../../x86_64-slackware-linux/bin/ld: skipping incompatible /usr/lib/libwx_gtk2u_adv-2.8.so when searching for -lwx_gtk2u_adv-2.8
/usr/lib64/gcc/x86_64-slackware-linux/4.6.2/../../../../x86_64-slackware-linux/bin/ld: skipping incompatible /usr/lib/libwx_gtk2u_core-2.8.so when searching for -lwx_gtk2u_core-2.8
/usr/lib64/gcc/x86_64-slackware-linux/4.6.2/../../../../x86_64-slackware-linux/bin/ld: skipping incompatible /usr/lib/libwx_baseu_net-2.8.so when searching for -lwx_baseu_net-2.8
/usr/lib64/gcc/x86_64-slackware-linux/4.6.2/../../../../x86_64-slackware-linux/bin/ld: skipping incompatible /usr/lib/libwx_baseu-2.8.so when searching for -lwx_baseu-2.8
/usr/lib64/gcc/x86_64-slackware-linux/4.6.2/../../../../x86_64-slackware-linux/bin/ld: skipping incompatible /usr/lib/libstdc++.so when searching for -lstdc++
/usr/lib64/gcc/x86_64-slackware-linux/4.6.2/../../../../x86_64-slackware-linux/bin/ld: skipping incompatible /usr/lib/libstdc++.a when searching for -lstdc++
/usr/lib64/gcc/x86_64-slackware-linux/4.6.2/../../../../x86_64-slackware-linux/bin/ld: skipping incompatible /usr/lib/libm.so when searching for -lm
/usr/lib64/gcc/x86_64-slackware-linux/4.6.2/../../../../x86_64-slackware-linux/bin/ld: skipping incompatible /usr/lib/libm.a when searching for -lm
/usr/lib64/gcc/x86_64-slackware-linux/4.6.2/../../../../x86_64-slackware-linux/bin/ld: skipping incompatible /usr/lib/libgcc_s.so when searching for -lgcc_s
/usr/lib64/gcc/x86_64-slackware-linux/4.6.2/../../../../x86_64-slackware-linux/bin/ld: skipping incompatible /usr/lib/libpthread.so when searching for -lpthread
/usr/lib64/gcc/x86_64-slackware-linux/4.6.2/../../../../x86_64-slackware-linux/bin/ld: skipping incompatible /usr/lib/libpthread.a when searching for -lpthread
/usr/lib64/gcc/x86_64-slackware-linux/4.6.2/../../../../x86_64-slackware-linux/bin/ld: skipping incompatible /usr/lib/libc.so when searching for -lc
/usr/lib64/gcc/x86_64-slackware-linux/4.6.2/../../../../x86_64-slackware-linux/bin/ld: skipping incompatible /usr/lib/libc.a when searching for -lc
/usr/lib64/gcc/x86_64-slackware-linux/4.6.2/../../../../x86_64-slackware-linux/bin/ld: skipping incompatible /usr/lib/libgcc_s.so when searching for -lgcc_s


Io direi di provare a ricompilare i pacchetti che ld(1) trova incompatibili.
Adoro il pragmatismo della lingua giapponese, è l'unica in cui per dire ad una ragazza che la ami le dici "suki". (cit.)
Avatar utente
hashbang
Packager
Packager
 
Messaggi: 1823
Iscritto il: ven giu 04, 2010 9:27
Località: Lecce
Nome Cognome: Luca De Pandis
Distribuzione: Windows 8.1 Pro

Re: Slackware-current..non compila più nulla?

Messaggioda Meskalamdug » lun mar 26, 2012 13:46

Provo a rinominare usr/lib provvisoriamente,
ricompilo,e vedo che errore da.
Meskalamdug
Iper Master
Iper Master
 
Messaggi: 3583
Iscritto il: gio mag 13, 2004 23:00

Re: Slackware-current..non compila più nulla?

Messaggioda Meskalamdug » lun mar 26, 2012 13:51

Codice: Seleziona tutto
ranlib libmuleappcore.a
g++ -W -Wall -Wshadow -Wundef -O2 -pthread   -lpthread  -o amule amule-CaptchaDialog.o amule-CaptchaGenerator.o amule-PartFileConvert.o amule-PartFileConvertDlg.o amule-amule.o amule-BaseClient.o amule-CanceledFileList.o amule-ClientList.o amule-ClientCreditsList.o amule-ClientTCPSocket.o amule-ClientUDPSocket.o amule-CorruptionBlackBox.o amule-DownloadClient.o amule-DownloadQueue.o amule-ECSpecialCoreTags.o amule-EMSocket.o amule-EncryptedStreamSocket.o amule-EncryptedDatagramSocket.o amule-ExternalConn.o amule-FriendList.o amule-IPFilter.o amule-KnownFileList.o amule-ListenSocket.o amule-MuleUDPSocket.o amule-SearchFile.o amule-SearchList.o amule-ServerConnect.o amule-ServerList.o amule-ServerSocket.o amule-ServerUDPSocket.o amule-SHAHashSet.o amule-SharedFileList.o amule-ThreadTasks.o amule-UploadBandwidthThrottler.o amule-UploadClient.o amule-UploadQueue.o amule-Indexed.o amule-Kademlia.o amule-Prefs.o amule-Search.o amule-UDPFirewallTester.o amule-KademliaUDPListener.o amule-PacketTracking.o amule-Contact.o amule-RoutingZone.o amule-amule-gui.o amule-amuleDlg.o amule-AddFriend.o amule-CatDialog.o amule-ChatSelector.o amule-ChatWnd.o amule-CommentDialog.o amule-CommentDialogLst.o amule-GenericClientListCtrl.o amule-ClientDetailDialog.o amule-DirectoryTreeCtrl.o amule-FileDetailDialog.o amule-KadDlg.o amule-OScopeCtrl.o amule-PrefsUnifiedDlg.o amule-SearchDlg.o amule-ServerWnd.o amule-SharedFilesWnd.o amule-StatisticsDlg.o amule-SearchListCtrl.o amule-DownloadListCtrl.o amule-SourceListCtrl.o amule-SharedFilePeersListCtrl.o amule-FriendListCtrl.o amule-ServerListCtrl.o amule-SharedFilesCtrl.o amule-MuleTrayIcon.o amule-TransferWnd.o amule-amuleAppCommon.o amule-ClientRef.o amule-DataToText.o amule-ECSpecialMuleTags.o amule-KnownFile.o amule-GetTickCount.o amule-GuiEvents.o amule-HTTPDownload.o amule-Logger.o amule-PartFile.o amule-Preferences.o amule-Proxy.o amule-Server.o amule-Statistics.o amule-StatTree.o amule-UserEvents.o -L. -lmuleappcommon -Llibs/common -Llibs/ec/cpp -lmulecommon -lec -lbfd -liberty   -lz  -L/usr/lib -lcryptopp -L. -lmuleappcore  -pthread   -lupnp -lthreadutil -lixml    -L. -lmuleappgui -L/usr/lib64 -pthread   -L/usr/X11R6/lib64   -lwx_gtk2u_adv-2.8 -lwx_gtk2u_core-2.8 -lwx_baseu_net-2.8 -lwx_baseu-2.8   -lGeoIP 
mv -f .deps/amuled-Statistics.Tpo .deps/amuled-Statistics.Po
mv -f .deps/amuled-Preferences.Tpo .deps/amuled-Preferences.Po
`.text._ZN8CryptoPP14InputRejectingINS_22BufferedTransformationEED2Ev' referenced in section `.text._ZN8CryptoPP14InputRejectingINS_22BufferedTransformationEED1Ev[non-virtual thunk to CryptoPP::InputRejecting<CryptoPP::BufferedTransformation>::~InputRejecting()]' of /usr/lib64/libcryptopp.a(files.o): defined in discarded section `.text._ZN8CryptoPP14InputRejectingINS_22BufferedTransformationEED2Ev[_ZN8CryptoPP14InputRejectingINS_22BufferedTransformationEED5Ev]' of /usr/lib64/libcryptopp.a(files.o)
`.text._ZN8CryptoPP13AutoSignalingINS_14InputRejectingINS_22BufferedTransformationEEEED2Ev' referenced in section `.text._ZN8CryptoPP13AutoSignalingINS_14InputRejectingINS_22BufferedTransformationEEEED1Ev[non-virtual thunk to CryptoPP::AutoSignaling<CryptoPP::InputRejecting<CryptoPP::BufferedTransformation> >::~AutoSignaling()]' of /usr/lib64/libcryptopp.a(files.o): defined in discarded section `.text._ZN8CryptoPP13AutoSignalingINS_14InputRejectingINS_22BufferedTransformationEEEED2Ev[_ZN8CryptoPP13AutoSignalingINS_14InputRejectingINS_22BufferedTransformationEEEED5Ev]' of /usr/lib64/libcryptopp.a(files.o)
`.text._ZN8CryptoPP4SinkD2Ev' referenced in section `.text._ZN8CryptoPP4SinkD1Ev[non-virtual thunk to CryptoPP::Sink::~Sink()]' of /usr/lib64/libcryptopp.a(files.o): defined in discarded section `.text._ZN8CryptoPP4SinkD2Ev[_ZN8CryptoPP4SinkD5Ev]' of /usr/lib64/libcryptopp.a(files.o)
`.text._ZN8CryptoPP14InputRejectingINS_6FilterEED2Ev' referenced in section `.text._ZN8CryptoPP14InputRejectingINS_6FilterEED1Ev[non-virtual thunk to CryptoPP::InputRejecting<CryptoPP::Filter>::~InputRejecting()]' of /usr/lib64/libcryptopp.a(files.o): defined in discarded section `.text._ZN8CryptoPP14InputRejectingINS_6FilterEED2Ev[_ZN8CryptoPP14InputRejectingINS_6FilterEED5Ev]' of /usr/lib64/libcryptopp.a(files.o)
`.text._ZN8CryptoPP6FilterD2Ev' referenced in section `.text._ZN8CryptoPP6FilterD1Ev[non-virtual thunk to CryptoPP::Filter::~Filter()]' of /usr/lib64/libcryptopp.a(files.o): defined in discarded section `.text._ZN8CryptoPP6FilterD2Ev[_ZN8CryptoPP6FilterD5Ev]' of /usr/lib64/libcryptopp.a(files.o)
`.text._ZN8CryptoPP6SourceD2Ev' referenced in section `.text._ZN8CryptoPP6SourceD1Ev[non-virtual thunk to CryptoPP::Source::~Source()]' of /usr/lib64/libcryptopp.a(files.o): defined in discarded section `.text._ZN8CryptoPP6SourceD2Ev[_ZN8CryptoPP6SourceD5Ev]' of /usr/lib64/libcryptopp.a(files.o)
`.text._ZN8CryptoPP14SourceTemplateINS_9FileStoreEED2Ev' referenced in section `.text._ZN8CryptoPP14SourceTemplateINS_9FileStoreEED1Ev[non-virtual thunk to CryptoPP::SourceTemplate<CryptoPP::FileStore>::~SourceTemplate()]' of /usr/lib64/libcryptopp.a(files.o): defined in discarded section `.text._ZN8CryptoPP14SourceTemplateINS_9FileStoreEED2Ev[_ZN8CryptoPP14SourceTemplateINS_9FileStoreEED5Ev]' of /usr/lib64/libcryptopp.a(files.o)
`.text._ZN8CryptoPP10FileSourceD2Ev' referenced in section `.text._ZN8CryptoPP10FileSourceD1Ev[non-virtual thunk to CryptoPP::FileSource::~FileSource()]' of /usr/lib64/libcryptopp.a(files.o): defined in discarded section `.text._ZN8CryptoPP10FileSourceD2Ev[_ZN8CryptoPP10FileSourceD5Ev]' of /usr/lib64/libcryptopp.a(files.o)
`.text._ZN8CryptoPP10BufferlessINS_4SinkEED2Ev' referenced in section `.text._ZN8CryptoPP10BufferlessINS_4SinkEED1Ev[non-virtual thunk to CryptoPP::Bufferless<CryptoPP::Sink>::~Bufferless()]' of /usr/lib64/libcryptopp.a(queue.o): defined in discarded section `.text._ZN8CryptoPP10BufferlessINS_4SinkEED2Ev[_ZN8CryptoPP10BufferlessINS_4SinkEED5Ev]' of /usr/lib64/libcryptopp.a(queue.o)
`.text._ZN8CryptoPP22TF_SignatureSchemeBaseINS_11PK_VerifierENS_7TF_BaseINS_16TrapdoorFunctionENS_33PK_SignatureMessageEncodingMethodEEEED2Ev' referenced in section `.text._ZN8CryptoPP22TF_SignatureSchemeBaseINS_11PK_VerifierENS_7TF_BaseINS_16TrapdoorFunctionENS_33PK_SignatureMessageEncodingMethodEEEED1Ev[non-virtual thunk to CryptoPP::TF_SignatureSchemeBase<CryptoPP::PK_Verifier, CryptoPP::TF_Base<CryptoPP::TrapdoorFunction, CryptoPP::PK_SignatureMessageEncodingMethod> >::~TF_SignatureSchemeBase()]' of /usr/lib64/libcryptopp.a(pubkey.o): defined in discarded section `.text._ZN8CryptoPP22TF_SignatureSchemeBaseINS_11PK_VerifierENS_7TF_BaseINS_16TrapdoorFunctionENS_33PK_SignatureMessageEncodingMethodEEEED2Ev[_ZN8CryptoPP22TF_SignatureSchemeBaseINS_11PK_VerifierENS_7TF_BaseINS_16TrapdoorFunctionENS_33PK_SignatureMessageEncodingMethodEEEED5Ev]' of /usr/lib64/libcryptopp.a(pubkey.o)
`.text._ZN8CryptoPP22TF_SignatureSchemeBaseINS_9PK_SignerENS_7TF_BaseINS_33RandomizedTrapdoorFunctionInverseENS_33PK_SignatureMessageEncodingMethodEEEED2Ev' referenced in section `.text._ZN8CryptoPP22TF_SignatureSchemeBaseINS_9PK_SignerENS_7TF_BaseINS_33RandomizedTrapdoorFunctionInverseENS_33PK_SignatureMessageEncodingMethodEEEED1Ev[non-virtual thunk to CryptoPP::TF_SignatureSchemeBase<CryptoPP::PK_Signer, CryptoPP::TF_Base<CryptoPP::RandomizedTrapdoorFunctionInverse, CryptoPP::PK_SignatureMessageEncodingMethod> >::~TF_SignatureSchemeBase()]' of /usr/lib64/libcryptopp.a(pubkey.o): defined in discarded section `.text._ZN8CryptoPP22TF_SignatureSchemeBaseINS_9PK_SignerENS_7TF_BaseINS_33RandomizedTrapdoorFunctionInverseENS_33PK_SignatureMessageEncodingMethodEEEED2Ev[_ZN8CryptoPP22TF_SignatureSchemeBaseINS_9PK_SignerENS_7TF_BaseINS_33RandomizedTrapdoorFunctionInverseENS_33PK_SignatureMessageEncodingMethodEEEED5Ev]' of /usr/lib64/libcryptopp.a(pubkey.o)
`.text._ZN8CryptoPP10BufferlessINS_6FilterEED2Ev' referenced in section `.text._ZN8CryptoPP10BufferlessINS_6FilterEED1Ev[non-virtual thunk to CryptoPP::Bufferless<CryptoPP::Filter>::~Bufferless()]' of /usr/lib64/libcryptopp.a(pubkey.o): defined in discarded section `.text._ZN8CryptoPP10BufferlessINS_6FilterEED2Ev[_ZN8CryptoPP10BufferlessINS_6FilterEED5Ev]' of /usr/lib64/libcryptopp.a(pubkey.o)
`.text._ZN8CryptoPP23FilterWithBufferedInputD2Ev' referenced in section `.text._ZN8CryptoPP23FilterWithBufferedInputD1Ev[non-virtual thunk to CryptoPP::FilterWithBufferedInput::~FilterWithBufferedInput()]' of /usr/lib64/libcryptopp.a(base64.o): defined in discarded section `.text._ZN8CryptoPP23FilterWithBufferedInputD2Ev[_ZN8CryptoPP23FilterWithBufferedInputD5Ev]' of /usr/lib64/libcryptopp.a(base64.o)
`.text._ZN8CryptoPP17SimpleProxyFilterD2Ev' referenced in section `.text._ZN8CryptoPP17SimpleProxyFilterD1Ev[non-virtual thunk to CryptoPP::SimpleProxyFilter::~SimpleProxyFilter()]' of /usr/lib64/libcryptopp.a(base64.o): defined in discarded section `.text._ZN8CryptoPP17SimpleProxyFilterD2Ev[_ZN8CryptoPP17SimpleProxyFilterD5Ev]' of /usr/lib64/libcryptopp.a(base64.o)
`.text._ZN8CryptoPP11UnflushableINS_6FilterEED2Ev' referenced in section `.text._ZN8CryptoPP11UnflushableINS_6FilterEED1Ev[non-virtual thunk to CryptoPP::Unflushable<CryptoPP::Filter>::~Unflushable()]' of /usr/lib64/libcryptopp.a(basecode.o): defined in discarded section `.text._ZN8CryptoPP11UnflushableINS_6FilterEED2Ev[_ZN8CryptoPP11UnflushableINS_6FilterEED5Ev]' of /usr/lib64/libcryptopp.a(basecode.o)
`.text._ZN8CryptoPP11BlockCipherD2Ev' referenced in section `.text._ZN8CryptoPP11BlockCipherD1Ev[non-virtual thunk to CryptoPP::BlockCipher::~BlockCipher()]' of /usr/lib64/libcryptopp.a(des.o): defined in discarded section `.text._ZN8CryptoPP11BlockCipherD2Ev[_ZN8CryptoPP11BlockCipherD5Ev]' of /usr/lib64/libcryptopp.a(des.o)
`.text._ZN8CryptoPP8TwoBasesINS_11BlockCipherENS_13DES_EDE3_InfoEED2Ev' referenced in section `.text._ZN8CryptoPP8TwoBasesINS_11BlockCipherENS_13DES_EDE3_InfoEED1Ev[non-virtual thunk to CryptoPP::TwoBases<CryptoPP::BlockCipher, CryptoPP::DES_EDE3_Info>::~TwoBases()]' of /usr/lib64/libcryptopp.a(des.o): defined in discarded section `.text._ZN8CryptoPP8TwoBasesINS_11BlockCipherENS_13DES_EDE3_InfoEED2Ev[_ZN8CryptoPP8TwoBasesINS_11BlockCipherENS_13DES_EDE3_InfoEED5Ev]' of /usr/lib64/libcryptopp.a(des.o)
`.text._ZN8CryptoPP25SimpleKeyingInterfaceImplINS_8TwoBasesINS_11BlockCipherENS_13DES_EDE3_InfoEEES4_ED2Ev' referenced in section `.text._ZN8CryptoPP25SimpleKeyingInterfaceImplINS_8TwoBasesINS_11BlockCipherENS_13DES_EDE3_InfoEEES4_ED1Ev[non-virtual thunk to CryptoPP::SimpleKeyingInterfaceImpl<CryptoPP::TwoBases<CryptoPP::BlockCipher, CryptoPP::DES_EDE3_Info>, CryptoPP::TwoBases<CryptoPP::BlockCipher, CryptoPP::DES_EDE3_Info> >::~SimpleKeyingInterfaceImpl()]' of /usr/lib64/libcryptopp.a(des.o): defined in discarded section `.text._ZN8CryptoPP25SimpleKeyingInterfaceImplINS_8TwoBasesINS_11BlockCipherENS_13DES_EDE3_InfoEEES4_ED2Ev[_ZN8CryptoPP25SimpleKeyingInterfaceImplINS_8TwoBasesINS_11BlockCipherENS_13DES_EDE3_InfoEEES4_ED5Ev]' of /usr/lib64/libcryptopp.a(des.o)
`.text._ZN8CryptoPP13AlgorithmImplINS_25SimpleKeyingInterfaceImplINS_8TwoBasesINS_11BlockCipherENS_13DES_EDE3_InfoEEES5_EES6_ED2Ev' referenced in section `.text._ZN8CryptoPP13AlgorithmImplINS_25SimpleKeyingInterfaceImplINS_8TwoBasesINS_11BlockCipherENS_13DES_EDE3_InfoEEES5_EES6_ED1Ev[non-virtual thunk to CryptoPP::AlgorithmImpl<CryptoPP::SimpleKeyingInterfaceImpl<CryptoPP::TwoBases<CryptoPP::BlockCipher, CryptoPP::DES_EDE3_Info>, CryptoPP::TwoBases<CryptoPP::BlockCipher, CryptoPP::DES_EDE3_Info> >, CryptoPP::SimpleKeyingInterfaceImpl<CryptoPP::TwoBases<CryptoPP::BlockCipher, CryptoPP::DES_EDE3_Info>, CryptoPP::TwoBases<CryptoPP::BlockCipher, CryptoPP::DES_EDE3_Info> > >::~AlgorithmImpl()]' of /usr/lib64/libcryptopp.a(des.o): defined in discarded section `.text._ZN8CryptoPP13AlgorithmImplINS_25SimpleKeyingInterfaceImplINS_8TwoBasesINS_11BlockCipherENS_13DES_EDE3_InfoEEES5_EES6_ED2Ev[_ZN8CryptoPP13AlgorithmImplINS_25SimpleKeyingInterfaceImplINS_8TwoBasesINS_11BlockCipherENS_13DES_EDE3_InfoEEES5_EES6_ED5Ev]' of /usr/lib64/libcryptopp.a(des.o)
`.text._ZN8CryptoPP15BlockCipherImplINS_13DES_EDE3_InfoENS_11BlockCipherEED2Ev' referenced in section `.text._ZN8CryptoPP15BlockCipherImplINS_13DES_EDE3_InfoENS_11BlockCipherEED1Ev[non-virtual thunk to CryptoPP::BlockCipherImpl<CryptoPP::DES_EDE3_Info, CryptoPP::BlockCipher>::~BlockCipherImpl()]' of /usr/lib64/libcryptopp.a(des.o): defined in discarded section `.text._ZN8CryptoPP15BlockCipherImplINS_13DES_EDE3_InfoENS_11BlockCipherEED2Ev[_ZN8CryptoPP15BlockCipherImplINS_13DES_EDE3_InfoENS_11BlockCipherEED5Ev]' of /usr/lib64/libcryptopp.a(des.o)
`.text._ZN8CryptoPP14SourceTemplateINS_11StringStoreEED2Ev' referenced in section `.text._ZN8CryptoPP14SourceTemplateINS_11StringStoreEED1Ev[non-virtual thunk to CryptoPP::SourceTemplate<CryptoPP::StringStore>::~SourceTemplate()]' of /usr/lib64/libcryptopp.a(dll.o): defined in discarded section `.text._ZN8CryptoPP14SourceTemplateINS_11StringStoreEED2Ev[_ZN8CryptoPP14SourceTemplateINS_11StringStoreEED5Ev]' of /usr/lib64/libcryptopp.a(dll.o)
`.text._ZN8CryptoPP12StringSourceD2Ev' referenced in section `.text._ZN8CryptoPP12StringSourceD1Ev[non-virtual thunk to CryptoPP::StringSource::~StringSource()]' of /usr/lib64/libcryptopp.a(dll.o): defined in discarded section `.text._ZN8CryptoPP12StringSourceD2Ev[_ZN8CryptoPP12StringSourceD5Ev]' of /usr/lib64/libcryptopp.a(dll.o)
`.text._ZN8CryptoPP13AlgorithmImplINS_13TF_SignerBaseENS_5TF_SSINS_8PKCS1v15ENS_4SHA1ENS_3RSAEiEEED2Ev' referenced in section `.text._ZN8CryptoPP13AlgorithmImplINS_13TF_SignerBaseENS_5TF_SSINS_8PKCS1v15ENS_4SHA1ENS_3RSAEiEEED1Ev[non-virtual thunk to CryptoPP::AlgorithmImpl<CryptoPP::TF_SignerBase, CryptoPP::TF_SS<CryptoPP::PKCS1v15, CryptoPP::SHA1, CryptoPP::RSA, int> >::~AlgorithmImpl()]' of /usr/lib64/libcryptopp.a(rsa.o): defined in discarded section `.text._ZN8CryptoPP13AlgorithmImplINS_13TF_SignerBaseENS_5TF_SSINS_8PKCS1v15ENS_4SHA1ENS_3RSAEiEEED2Ev[_ZN8CryptoPP13AlgorithmImplINS_13TF_SignerBaseENS_5TF_SSINS_8PKCS1v15ENS_4SHA1ENS_3RSAEiEEED5Ev]' of /usr/lib64/libcryptopp.a(rsa.o)
`.text._ZN8CryptoPP17TF_ObjectImplBaseINS_13TF_SignerBaseENS_25TF_SignatureSchemeOptionsINS_5TF_SSINS_8PKCS1v15ENS_4SHA1ENS_3RSAEiEES6_NS_39PKCS1v15_SignatureMessageEncodingMethodES5_EENS_21InvertibleRSAFunctionEED2Ev' referenced in section `.text._ZN8CryptoPP17TF_ObjectImplBaseINS_13TF_SignerBaseENS_25TF_SignatureSchemeOptionsINS_5TF_SSINS_8PKCS1v15ENS_4SHA1ENS_3RSAEiEES6_NS_39PKCS1v15_SignatureMessageEncodingMethodES5_EENS_21InvertibleRSAFunctionEED1Ev[non-virtual thunk to CryptoPP::TF_ObjectImplBase<CryptoPP::TF_SignerBase, CryptoPP::TF_SignatureSchemeOptions<CryptoPP::TF_SS<CryptoPP::PKCS1v15, CryptoPP::SHA1, CryptoPP::RSA, int>, CryptoPP::RSA, CryptoPP::PKCS1v15_SignatureMessageEncodingMethod, CryptoPP::SHA1>, CryptoPP::InvertibleRSAFunction>::~TF_ObjectImplBase()]' of /usr/lib64/libcryptopp.a(rsa.o): defined in discarded section `.text._ZN8CryptoPP17TF_ObjectImplBaseINS_13TF_SignerBaseENS_25TF_SignatureSchemeOptionsINS_5TF_SSINS_8PKCS1v15ENS_4SHA1ENS_3RSAEiEES6_NS_39PKCS1v15_SignatureMessageEncodingMethodES5_EENS_21InvertibleRSAFunctionEED2Ev[_ZN8CryptoPP17TF_ObjectImplBaseINS_13TF_SignerBaseENS_25TF_SignatureSchemeOptionsINS_5TF_SSINS_8PKCS1v15ENS_4SHA1ENS_3RSAEiEES6_NS_39PKCS1v15_SignatureMessageEncodingMethodES5_EENS_21InvertibleRSAFunctionEED5Ev]' of /usr/lib64/libcryptopp.a(rsa.o)
`.text._ZN8CryptoPP13AlgorithmImplINS_15TF_VerifierBaseENS_5TF_SSINS_8PKCS1v15ENS_4SHA1ENS_3RSAEiEEED2Ev' referenced in section `.text._ZN8CryptoPP13AlgorithmImplINS_15TF_VerifierBaseENS_5TF_SSINS_8PKCS1v15ENS_4SHA1ENS_3RSAEiEEED1Ev[non-virtual thunk to CryptoPP::AlgorithmImpl<CryptoPP::TF_VerifierBase, CryptoPP::TF_SS<CryptoPP::PKCS1v15, CryptoPP::SHA1, CryptoPP::RSA, int> >::~AlgorithmImpl()]' of /usr/lib64/libcryptopp.a(rsa.o): defined in discarded section `.text._ZN8CryptoPP13AlgorithmImplINS_15TF_VerifierBaseENS_5TF_SSINS_8PKCS1v15ENS_4SHA1ENS_3RSAEiEEED2Ev[_ZN8CryptoPP13AlgorithmImplINS_15TF_VerifierBaseENS_5TF_SSINS_8PKCS1v15ENS_4SHA1ENS_3RSAEiEEED5Ev]' of /usr/lib64/libcryptopp.a(rsa.o)
`.text._ZN8CryptoPP17TF_ObjectImplBaseINS_15TF_VerifierBaseENS_25TF_SignatureSchemeOptionsINS_5TF_SSINS_8PKCS1v15ENS_4SHA1ENS_3RSAEiEES6_NS_39PKCS1v15_SignatureMessageEncodingMethodES5_EENS_11RSAFunctionEED2Ev' referenced in section `.text._ZN8CryptoPP17TF_ObjectImplBaseINS_15TF_VerifierBaseENS_25TF_SignatureSchemeOptionsINS_5TF_SSINS_8PKCS1v15ENS_4SHA1ENS_3RSAEiEES6_NS_39PKCS1v15_SignatureMessageEncodingMethodES5_EENS_11RSAFunctionEED1Ev[non-virtual thunk to CryptoPP::TF_ObjectImplBase<CryptoPP::TF_VerifierBase, CryptoPP::TF_SignatureSchemeOptions<CryptoPP::TF_SS<CryptoPP::PKCS1v15, CryptoPP::SHA1, CryptoPP::RSA, int>, CryptoPP::RSA, CryptoPP::PKCS1v15_SignatureMessageEncodingMethod, CryptoPP::SHA1>, CryptoPP::RSAFunction>::~TF_ObjectImplBase()]' of /usr/lib64/libcryptopp.a(rsa.o): defined in discarded section `.text._ZN8CryptoPP17TF_ObjectImplBaseINS_15TF_VerifierBaseENS_25TF_SignatureSchemeOptionsINS_5TF_SSINS_8PKCS1v15ENS_4SHA1ENS_3RSAEiEES6_NS_39PKCS1v15_SignatureMessageEncodingMethodES5_EENS_11RSAFunctionEED2Ev[_ZN8CryptoPP17TF_ObjectImplBaseINS_15TF_VerifierBaseENS_25TF_SignatureSchemeOptionsINS_5TF_SSINS_8PKCS1v15ENS_4SHA1ENS_3RSAEiEES6_NS_39PKCS1v15_SignatureMessageEncodingMethodES5_EENS_11RSAFunctionEED5Ev]' of /usr/lib64/libcryptopp.a(rsa.o)
`.text._ZN8CryptoPP13TF_ObjectImplINS_15TF_VerifierBaseENS_25TF_SignatureSchemeOptionsINS_5TF_SSINS_8PKCS1v15ENS_4SHA1ENS_3RSAEiEES6_NS_39PKCS1v15_SignatureMessageEncodingMethodES5_EENS_11RSAFunctionEED2Ev' referenced in section `.text._ZN8CryptoPP13TF_ObjectImplINS_15TF_VerifierBaseENS_25TF_SignatureSchemeOptionsINS_5TF_SSINS_8PKCS1v15ENS_4SHA1ENS_3RSAEiEES6_NS_39PKCS1v15_SignatureMessageEncodingMethodES5_EENS_11RSAFunctionEED1Ev[non-virtual thunk to CryptoPP::TF_ObjectImpl<CryptoPP::TF_VerifierBase, CryptoPP::TF_SignatureSchemeOptions<CryptoPP::TF_SS<CryptoPP::PKCS1v15, CryptoPP::SHA1, CryptoPP::RSA, int>, CryptoPP::RSA, CryptoPP::PKCS1v15_SignatureMessageEncodingMethod, CryptoPP::SHA1>, CryptoPP::RSAFunction>::~TF_ObjectImpl()]' of /usr/lib64/libcryptopp.a(rsa.o): defined in discarded section `.text._ZN8CryptoPP13TF_ObjectImplINS_15TF_VerifierBaseENS_25TF_SignatureSchemeOptionsINS_5TF_SSINS_8PKCS1v15ENS_4SHA1ENS_3RSAEiEES6_NS_39PKCS1v15_SignatureMessageEncodingMethodES5_EENS_11RSAFunctionEED2Ev[_ZN8CryptoPP13TF_ObjectImplINS_15TF_VerifierBaseENS_25TF_SignatureSchemeOptionsINS_5TF_SSINS_8PKCS1v15ENS_4SHA1ENS_3RSAEiEES6_NS_39PKCS1v15_SignatureMessageEncodingMethodES5_EENS_11RSAFunctionEED5Ev]' of /usr/lib64/libcryptopp.a(rsa.o)
`.text._ZN8CryptoPP15TF_VerifierImplINS_25TF_SignatureSchemeOptionsINS_5TF_SSINS_8PKCS1v15ENS_4SHA1ENS_3RSAEiEES5_NS_39PKCS1v15_SignatureMessageEncodingMethodES4_EEED2Ev' referenced in section `.text._ZN8CryptoPP15TF_VerifierImplINS_25TF_SignatureSchemeOptionsINS_5TF_SSINS_8PKCS1v15ENS_4SHA1ENS_3RSAEiEES5_NS_39PKCS1v15_SignatureMessageEncodingMethodES4_EEED1Ev[non-virtual thunk to CryptoPP::TF_VerifierImpl<CryptoPP::TF_SignatureSchemeOptions<CryptoPP::TF_SS<CryptoPP::PKCS1v15, CryptoPP::SHA1, CryptoPP::RSA, int>, CryptoPP::RSA, CryptoPP::PKCS1v15_SignatureMessageEncodingMethod, CryptoPP::SHA1> >::~TF_VerifierImpl()]' of /usr/lib64/libcryptopp.a(rsa.o): defined in discarded section `.text._ZN8CryptoPP15TF_VerifierImplINS_25TF_SignatureSchemeOptionsINS_5TF_SSINS_8PKCS1v15ENS_4SHA1ENS_3RSAEiEES5_NS_39PKCS1v15_SignatureMessageEncodingMethodES4_EEED2Ev[_ZN8CryptoPP15TF_VerifierImplINS_25TF_SignatureSchemeOptionsINS_5TF_SSINS_8PKCS1v15ENS_4SHA1ENS_3RSAEiEES5_NS_39PKCS1v15_SignatureMessageEncodingMethodES4_EEED5Ev]' of /usr/lib64/libcryptopp.a(rsa.o)
`.text._ZN8CryptoPP16PK_FinalTemplateINS_15TF_VerifierImplINS_25TF_SignatureSchemeOptionsINS_5TF_SSINS_8PKCS1v15ENS_4SHA1ENS_3RSAEiEES6_NS_39PKCS1v15_SignatureMessageEncodingMethodES5_EEEEED2Ev' referenced in section `.text._ZN8CryptoPP16PK_FinalTemplateINS_15TF_VerifierImplINS_25TF_SignatureSchemeOptionsINS_5TF_SSINS_8PKCS1v15ENS_4SHA1ENS_3RSAEiEES6_NS_39PKCS1v15_SignatureMessageEncodingMethodES5_EEEEED1Ev[non-virtual thunk to CryptoPP::PK_FinalTemplate<CryptoPP::TF_VerifierImpl<CryptoPP::TF_SignatureSchemeOptions<CryptoPP::TF_SS<CryptoPP::PKCS1v15, CryptoPP::SHA1, CryptoPP::RSA, int>, CryptoPP::RSA, CryptoPP::PKCS1v15_SignatureMessageEncodingMethod, CryptoPP::SHA1> > >::~PK_FinalTemplate()]' of /usr/lib64/libcryptopp.a(rsa.o): defined in discarded section `.text._ZN8CryptoPP16PK_FinalTemplateINS_15TF_VerifierImplINS_25TF_SignatureSchemeOptionsINS_5TF_SSINS_8PKCS1v15ENS_4SHA1ENS_3RSAEiEES6_NS_39PKCS1v15_SignatureMessageEncodingMethodES5_EEEEED2Ev[_ZN8CryptoPP16PK_FinalTemplateINS_15TF_VerifierImplINS_25TF_SignatureSchemeOptionsINS_5TF_SSINS_8PKCS1v15ENS_4SHA1ENS_3RSAEiEES6_NS_39PKCS1v15_SignatureMessageEncodingMethodES5_EEEEED5Ev]' of /usr/lib64/libcryptopp.a(rsa.o)
`.text._ZN8CryptoPP13TF_ObjectImplINS_13TF_SignerBaseENS_25TF_SignatureSchemeOptionsINS_5TF_SSINS_8PKCS1v15ENS_4SHA1ENS_3RSAEiEES6_NS_39PKCS1v15_SignatureMessageEncodingMethodES5_EENS_21InvertibleRSAFunctionEED2Ev' referenced in section `.text._ZN8CryptoPP13TF_ObjectImplINS_13TF_SignerBaseENS_25TF_SignatureSchemeOptionsINS_5TF_SSINS_8PKCS1v15ENS_4SHA1ENS_3RSAEiEES6_NS_39PKCS1v15_SignatureMessageEncodingMethodES5_EENS_21InvertibleRSAFunctionEED1Ev[non-virtual thunk to CryptoPP::TF_ObjectImpl<CryptoPP::TF_SignerBase, CryptoPP::TF_SignatureSchemeOptions<CryptoPP::TF_SS<CryptoPP::PKCS1v15, CryptoPP::SHA1, CryptoPP::RSA, int>, CryptoPP::RSA, CryptoPP::PKCS1v15_SignatureMessageEncodingMethod, CryptoPP::SHA1>, CryptoPP::InvertibleRSAFunction>::~TF_ObjectImpl()]' of /usr/lib64/libcryptopp.a(rsa.o): defined in discarded section `.text._ZN8CryptoPP13TF_ObjectImplINS_13TF_SignerBaseENS_25TF_SignatureSchemeOptionsINS_5TF_SSINS_8PKCS1v15ENS_4SHA1ENS_3RSAEiEES6_NS_39PKCS1v15_SignatureMessageEncodingMethodES5_EENS_21InvertibleRSAFunctionEED2Ev[_ZN8CryptoPP13TF_ObjectImplINS_13TF_SignerBaseENS_25TF_SignatureSchemeOptionsINS_5TF_SSINS_8PKCS1v15ENS_4SHA1ENS_3RSAEiEES6_NS_39PKCS1v15_SignatureMessageEncodingMethodES5_EENS_21InvertibleRSAFunctionEED5Ev]' of /usr/lib64/libcryptopp.a(rsa.o)
`.text._ZN8CryptoPP13TF_SignerImplINS_25TF_SignatureSchemeOptionsINS_5TF_SSINS_8PKCS1v15ENS_4SHA1ENS_3RSAEiEES5_NS_39PKCS1v15_SignatureMessageEncodingMethodES4_EEED2Ev' referenced in section `.text._ZN8CryptoPP13TF_SignerImplINS_25TF_SignatureSchemeOptionsINS_5TF_SSINS_8PKCS1v15ENS_4SHA1ENS_3RSAEiEES5_NS_39PKCS1v15_SignatureMessageEncodingMethodES4_EEED1Ev[non-virtual thunk to CryptoPP::TF_SignerImpl<CryptoPP::TF_SignatureSchemeOptions<CryptoPP::TF_SS<CryptoPP::PKCS1v15, CryptoPP::SHA1, CryptoPP::RSA, int>, CryptoPP::RSA, CryptoPP::PKCS1v15_SignatureMessageEncodingMethod, CryptoPP::SHA1> >::~TF_SignerImpl()]' of /usr/lib64/libcryptopp.a(rsa.o): defined in discarded section `.text._ZN8CryptoPP13TF_SignerImplINS_25TF_SignatureSchemeOptionsINS_5TF_SSINS_8PKCS1v15ENS_4SHA1ENS_3RSAEiEES5_NS_39PKCS1v15_SignatureMessageEncodingMethodES4_EEED2Ev[_ZN8CryptoPP13TF_SignerImplINS_25TF_SignatureSchemeOptionsINS_5TF_SSINS_8PKCS1v15ENS_4SHA1ENS_3RSAEiEES5_NS_39PKCS1v15_SignatureMessageEncodingMethodES4_EEED5Ev]' of /usr/lib64/libcryptopp.a(rsa.o)
`.text._ZN8CryptoPP16PK_FinalTemplateINS_13TF_SignerImplINS_25TF_SignatureSchemeOptionsINS_5TF_SSINS_8PKCS1v15ENS_4SHA1ENS_3RSAEiEES6_NS_39PKCS1v15_SignatureMessageEncodingMethodES5_EEEEED2Ev' referenced in section `.text._ZN8CryptoPP16PK_FinalTemplateINS_13TF_SignerImplINS_25TF_SignatureSchemeOptionsINS_5TF_SSINS_8PKCS1v15ENS_4SHA1ENS_3RSAEiEES6_NS_39PKCS1v15_SignatureMessageEncodingMethodES5_EEEEED1Ev[non-virtual thunk to CryptoPP::PK_FinalTemplate<CryptoPP::TF_SignerImpl<CryptoPP::TF_SignatureSchemeOptions<CryptoPP::TF_SS<CryptoPP::PKCS1v15, CryptoPP::SHA1, CryptoPP::RSA, int>, CryptoPP::RSA, CryptoPP::PKCS1v15_SignatureMessageEncodingMethod, CryptoPP::SHA1> > >::~PK_FinalTemplate()]' of /usr/lib64/libcryptopp.a(rsa.o): defined in discarded section `.text._ZN8CryptoPP16PK_FinalTemplateINS_13TF_SignerImplINS_25TF_SignatureSchemeOptionsINS_5TF_SSINS_8PKCS1v15ENS_4SHA1ENS_3RSAEiEES6_NS_39PKCS1v15_SignatureMessageEncodingMethodES5_EEEEED2Ev[_ZN8CryptoPP16PK_FinalTemplateINS_13TF_SignerImplINS_25TF_SignatureSchemeOptionsINS_5TF_SSINS_8PKCS1v15ENS_4SHA1ENS_3RSAEiEES6_NS_39PKCS1v15_SignatureMessageEncodingMethodES5_EEEEED5Ev]' of /usr/lib64/libcryptopp.a(rsa.o)
collect2: ld returned 1 exit status
make[3]: *** [amule] Errore 1
make[3]: *** Attesa dei processi non terminati....
mv -f .deps/amuled-PartFile.Tpo .deps/amuled-PartFile.Po
make[3]: Leaving directory `/tmp/buildpkgs/amule/amule/src'
make[2]: *** [all-recursive] Errore 1
make[2]: Leaving directory `/tmp/buildpkgs/amule/amule/src'
make[1]: *** [all-recursive] Errore 1
make[1]: Leaving directory `/tmp/buildpkgs/amule/amule'


Direi..cryptopp?
Meskalamdug
Iper Master
Iper Master
 
Messaggi: 3583
Iscritto il: gio mag 13, 2004 23:00

Re: Slackware-current..non compila più nulla?

Messaggioda Meskalamdug » lun mar 26, 2012 14:00

Amule risolto.
Peccato per apcusd!
:(
Meskalamdug
Iper Master
Iper Master
 
Messaggi: 3583
Iscritto il: gio mag 13, 2004 23:00

Re: Slackware-current..non compila più nulla?

Messaggioda roberto67 » mar mar 27, 2012 14:19

anche io ho amule che non compila più (slackbuild di slacky.eu) dopo l'aggiornamento all'ultima current.
potresti dire come hai risolto? grazie :)
roberto67
Packager
Packager
 
Messaggi: 289
Iscritto il: lun set 14, 2009 17:55
Slackware: 14.1 multilib
Desktop: kde

Re: Slackware-current..non compila più nulla?

Messaggioda Meskalamdug » mar mar 27, 2012 14:51

roberto67 ha scritto:anche io ho amule che non compila più (slackbuild di slacky.eu) dopo l'aggiornamento all'ultima current.
potresti dire come hai risolto? grazie :)

Ricompilando cryptopp
Sto usando la git di amule.
Meskalamdug
Iper Master
Iper Master
 
Messaggi: 3583
Iscritto il: gio mag 13, 2004 23:00

Re: Slackware-current..non compila più nulla?

Messaggioda roberto67 » mar mar 27, 2012 16:30

Meskalamdug ha scritto:
roberto67 ha scritto:anche io ho amule che non compila più (slackbuild di slacky.eu) dopo l'aggiornamento all'ultima current.
potresti dire come hai risolto? grazie :)

Ricompilando cryptopp
Sto usando la git di amule.


per quanto riguarda cryptopp, quale slackbuild stai usando? quello scaricato da slacky.eu compilato sulla -current + multilib va in errore:

Codice: Seleziona tutto
patching file GNUmakefile
g++ -DNDEBUG -g -O2 -march=native -mtune=native -pipe -c wake.cpp
In file included from wake.h:5:0,
                 from wake.cpp:4:
secblock.h: In instantiation of ‘CryptoPP::AllocatorWithCleanup<T, T_Align16>::pointer CryptoPP::AllocatorWithCleanup<T, T_Align16>::allocate(CryptoPP::AllocatorWithCleanup<T, T_Align16>::size_type, const void*) [with T = unsigned char; bool T_Align16 = false; CryptoPP::AllocatorWithCleanup<T, T_Align16>::pointer = unsigned char*; CryptoPP::AllocatorWithCleanup<T, T_Align16>::size_type = long unsigned int]’:
secblock.h:283:19:   required from ‘CryptoPP::SecBlock<T, A>::SecBlock(CryptoPP::SecBlock<T, A>::size_type) [with T = unsigned char; A = CryptoPP::AllocatorWithCleanup<unsigned char>; CryptoPP::SecBlock<T, A>::size_type = long unsigned int]’
strciphr.h:134:26:   required from ‘CryptoPP::SymmetricCipherFinal<BASE, INFO>::SymmetricCipherFinal() [with BASE = CryptoPP::ConcretePolicyHolder<CryptoPP::WAKE_Policy<CryptoPP::EnumToType<CryptoPP::ByteOrder, 1> >, CryptoPP::AdditiveCipherTemplate<CryptoPP::AbstractPolicyHolder<CryptoPP::AdditiveCipherAbstractPolicy, CryptoPP::SymmetricCipher> >, CryptoPP::AdditiveCipherAbstractPolicy>; INFO = CryptoPP::WAKE_OFB_Info<CryptoPP::EnumToType<CryptoPP::ByteOrder, 1> >]’
wake.cpp:12:25:   required from here
secblock.h:97:3: error: ‘CheckSize’ was not declared in this scope, and no declarations were found by argument-dependent lookup at the point of instantiation [-fpermissive]
secblock.h:97:3: note: declarations in dependent base ‘CryptoPP::AllocatorBase<unsigned char>’ are not found by unqualified lookup
secblock.h:97:3: note: use ‘this->CheckSize’ instead
make: *** [wake.o] Error 1
roberto67
Packager
Packager
 
Messaggi: 289
Iscritto il: lun set 14, 2009 17:55
Slackware: 14.1 multilib
Desktop: kde

Re: Slackware-current..non compila più nulla?

Messaggioda Meskalamdug » mar mar 27, 2012 17:09

roberto67 ha scritto:
Meskalamdug ha scritto:
roberto67 ha scritto:anche io ho amule che non compila più (slackbuild di slacky.eu) dopo l'aggiornamento all'ultima current.
potresti dire come hai risolto? grazie :)

Ricompilando cryptopp
Sto usando la git di amule.


per quanto riguarda cryptopp, quale slackbuild stai usando? quello scaricato da slacky.eu compilato sulla -current + multilib va in errore:

Codice: Seleziona tutto
patching file GNUmakefile
g++ -DNDEBUG -g -O2 -march=native -mtune=native -pipe -c wake.cpp
In file included from wake.h:5:0,
                 from wake.cpp:4:
secblock.h: In instantiation of ‘CryptoPP::AllocatorWithCleanup<T, T_Align16>::pointer CryptoPP::AllocatorWithCleanup<T, T_Align16>::allocate(CryptoPP::AllocatorWithCleanup<T, T_Align16>::size_type, const void*) [with T = unsigned char; bool T_Align16 = false; CryptoPP::AllocatorWithCleanup<T, T_Align16>::pointer = unsigned char*; CryptoPP::AllocatorWithCleanup<T, T_Align16>::size_type = long unsigned int]’:
secblock.h:283:19:   required from ‘CryptoPP::SecBlock<T, A>::SecBlock(CryptoPP::SecBlock<T, A>::size_type) [with T = unsigned char; A = CryptoPP::AllocatorWithCleanup<unsigned char>; CryptoPP::SecBlock<T, A>::size_type = long unsigned int]’
strciphr.h:134:26:   required from ‘CryptoPP::SymmetricCipherFinal<BASE, INFO>::SymmetricCipherFinal() [with BASE = CryptoPP::ConcretePolicyHolder<CryptoPP::WAKE_Policy<CryptoPP::EnumToType<CryptoPP::ByteOrder, 1> >, CryptoPP::AdditiveCipherTemplate<CryptoPP::AbstractPolicyHolder<CryptoPP::AdditiveCipherAbstractPolicy, CryptoPP::SymmetricCipher> >, CryptoPP::AdditiveCipherAbstractPolicy>; INFO = CryptoPP::WAKE_OFB_Info<CryptoPP::EnumToType<CryptoPP::ByteOrder, 1> >]’
wake.cpp:12:25:   required from here
secblock.h:97:3: error: ‘CheckSize’ was not declared in this scope, and no declarations were found by argument-dependent lookup at the point of instantiation [-fpermissive]
secblock.h:97:3: note: declarations in dependent base ‘CryptoPP::AllocatorBase<unsigned char>’ are not found by unqualified lookup
secblock.h:97:3: note: use ‘this->CheckSize’ instead
make: *** [wake.o] Error 1

Non so che dirti..hai aggiornato la current?
Attento che l'ultimo changelog è indietro.
Meskalamdug
Iper Master
Iper Master
 
Messaggi: 3583
Iscritto il: gio mag 13, 2004 23:00

Re: Slackware-current..non compila più nulla?

Messaggioda conraid » mar mar 27, 2012 17:33

l'errore in secblock lo risolvi tramite una patch,
http://cryptopp.svn.sourceforge.net/vie ... 509&r2=522
è che poi trovi errori da altre parti, sono software "vecchi", vanno usate le versioni in sviluppo

io sto ammattendo con la nuova current (anche se il primo messaggio del poster non si riferisce all'ultima current visto che usa gcc 4.6.2), e non solo per la compilazione, anche alcune applicazioni non vanno (svn su tutte) se non caricando la libreria math dalle glibc 2.14
ho visto che è un problema delle glibc già segnalato, e già corretto nella versione in sviluppo. Altre distribuzioni hanno fatto il backporting delle varie patch... ma che palle queste glibc
Avatar utente
conraid
Staff
Staff
 
Messaggi: 11987
Iscritto il: mer lug 13, 2005 23:00
Località: Livorno
Nome Cognome: Corrado Franco
Slackware: current

Re: Slackware-current..non compila più nulla?

Messaggioda Meskalamdug » mar mar 27, 2012 17:39

conraid ha scritto:l'errore in secblock lo risolvi tramite una patch,
http://cryptopp.svn.sourceforge.net/vie ... 509&r2=522
è che poi trovi errori da altre parti, sono software "vecchi", vanno usate le versioni in sviluppo

io sto ammattendo con la nuova current (anche se il primo messaggio del poster non si riferisce all'ultima current visto che usa gcc 4.6.2), e non solo per la compilazione, anche alcune applicazioni non vanno (svn su tutte) se non caricando la libreria math dalle glibc 2.14
ho visto che è un problema delle glibc già segnalato, e già corretto nella versione in sviluppo. Altre distribuzioni hanno fatto il backporting delle varie patch... ma che palle queste glibc

È una delle rogne dell'os
Quando non sono progetti attivi che non stanno al passo ecco che vengono fuori errori di compilazione,patch,versioni multiple delle librerie,etc.
Fosse tutto r&f sarebbe bello,ma irrealistico.
:D
Meskalamdug
Iper Master
Iper Master
 
Messaggi: 3583
Iscritto il: gio mag 13, 2004 23:00

Re: Slackware-current..non compila più nulla?

Messaggioda roberto67 » mar mar 27, 2012 19:54

Meskalamdug ha scritto:[...]
Non so che dirti..hai aggiornato la current?
Attento che l'ultimo changelog è indietro.


si, quella di ieri. Sopra ho dovuto reinstallare sopra i multilib e le dipendenze di kde 4.8.1, quindi non è esattamente una -current..
amule pare essere l'unica cosa che non va..
roberto67
Packager
Packager
 
Messaggi: 289
Iscritto il: lun set 14, 2009 17:55
Slackware: 14.1 multilib
Desktop: kde

Re: Slackware-current..non compila più nulla?

Messaggioda shark1500 » mar mar 27, 2012 20:03

Ho letto su linuxquestions che anche subversion dava dei problemi, ma sembrano problemi solo della 64 bit.
Avatar utente
shark1500
Linux 2.6
Linux 2.6
 
Messaggi: 785
Iscritto il: gio apr 03, 2008 13:33
Località: Modna
Slackware: current
Kernel: 2.6.27.7-smp
Desktop: kde

Re: Slackware-current..non compila più nulla?

Messaggioda roberto67 » mar mar 27, 2012 20:04

conraid ha scritto:l'errore in secblock lo risolvi tramite una patch,
http://cryptopp.svn.sourceforge.net/vie ... 509&r2=522
è che poi trovi errori da altre parti, sono software "vecchi", vanno usate le versioni in sviluppo
[...]


si confermo che la compilazione si blocca più avanti.. :(
roberto67
Packager
Packager
 
Messaggi: 289
Iscritto il: lun set 14, 2009 17:55
Slackware: 14.1 multilib
Desktop: kde

Re: Slackware-current..non compila più nulla?

Messaggioda ZeroUno » mar mar 27, 2012 22:20

roberto67 ha scritto:Sopra ho dovuto reinstallare sopra i multilib

Se non hai bisogno di compilare a 32bit evita le multilib di alien e usa quelle di slacky
http://repository.slacky.eu/slackware64 ... libraries/
che hanno invasività == 0
Packages finder: slakfinder.org | Slackpkg+, per aggiungere repository a slackpkg
Codice: Seleziona tutto
1011010 1100101 1110010 1101111 - 0100000 - 1010101 1101110 1101111
Avatar utente
ZeroUno
Staff
Staff
 
Messaggi: 4300
Iscritto il: ven giu 02, 2006 13:52
Località: Roma / Castelli
Nome Cognome: Matteo Rossini
Slackware: current
Kernel: slack-current
Desktop: ktown-latest
Distribuzione: 01000000-current

Prossimo

Torna a Slackware64

Chi c’è in linea

Visitano il forum: Nessuno e 3 ospiti

cron