compilazione grive

Se avete problemi con l'installazione e la configurazione di Slackware postate qui. Non usate questo forum per argomenti generali... per quelli usate Gnu/Linux in genere.

Moderatore: Staff

Regole del forum
1) Citare sempre la versione di Slackware usata, la versione del Kernel e magari anche la versione della libreria coinvolta. Questi dati aiutano le persone che possono rispondere.
2) Per evitare confusione prego inserire in questo forum solo topic che riguardano appunto Slackware, se l'argomento è generale usate il forum Gnu/Linux in genere.
3) Leggere attentamente le risposte ricevute.
4) Scrivere i messaggi con il colore di default, evitare altri colori.
5) Scrivere in Italiano o in Inglese, se possibile grammaticalmente corretto, evitate stili di scrittura poco chiari, quindi nessuna abbreviazione tipo telegramma o scrittura stile SMS o CHAT.
6) Appena registrati è consigliato presentarsi nel forum dedicato.

La non osservanza delle regole porta a provvedimenti di vari tipo da parte dello staff, in particolare la non osservanza della regola 5 porta alla cancellazione del post e alla segnalazione dell'utente. In caso di recidività l'utente rischia il ban temporaneo.
fiat595
Linux 1.0
Linux 1.0
Messaggi: 60
Iscritto il: gio giu 09, 2005 0:00
Nome Cognome: Costantino Pintus
Slackware: 12.2
Kernel: 2.6.27.7
Desktop: gnome
Località: oristano
Contatta:

compilazione grive

Messaggioda fiat595 » dom set 23, 2012 21:35

salve a tutti come da titolo sto cercando di compilare grive si slack 13.37 32 bit ma ricevo sempre lo stesso errore
Linking CXX executable grive
../libgrive/libgrive.so.0.1.1: undefined reference to `gr::StdioFile::StdioFile(boost::filesystem2::basic_path<std::basic_string<char, std::char_traits<char>, std::allocator<char> >, boost::filesystem2::path_traits> const&)'
../libgrive/libgrive.so.0.1.1: undefined reference to `gr::crypt::MD5(boost::filesystem3::path const&)'
collect2: ld returned 1 exit status
make[2]: *** [grive/grive] Error 1
make[1]: *** [grive/CMakeFiles/grive_executable.dir/all] Error 2
make: *** [all] Error 2

volevo sapere se qualcuno di voi è riuscito a compilarlo anche perche questo preciso errore lo da anche su molte altre distribuzioni
grazie in anticipo

Torna a “Slackware”

Chi c’è in linea

Visitano il forum: Yahoo [Bot] e 1 ospite