Pagina 1 di 1

Problemi compilazione...

Inviato: ven 16 lug 2004, 8:55
da salbutamolo
Ciao a tutti,
<BR>ho dei problemi nel compilare i software che girano con interfaccia KDE. Non tutti x la verità, perchè ad esempio kvirc l´ho compilato senza problemi. Tuttavia con parecchi programmi ottengo un errore in fase di installazione, dopo il configure, e il make. Io uso checkinstall per pacchettizare il software ( lo so che non è la cosa migliore :-P ) ma di fatto prima di generare il pacchetto simula un make install. L´errore che ottengo cercando di installare knetworkled e altri software è il seguente:
<BR>
<BR><!-- BBCode Quote Start --><TABLE BORDER=0 ALIGN=CENTER WIDTH=85%><TR><TD><font size=-1>Quote:</font><HR></TD></TR><TR><TD><FONT SIZE=-1><BLOCKQUOTE>Installing with make install...
<BR>
<BR>========================= Installation results ===========================
<BR>Making install in doc
<BR>make[1]: Entering directory `/home/nemesi/Documents/Downloads/knetworkled-0.5.1/doc´
<BR>Making install in .
<BR>make[2]: Entering directory `/home/nemesi/Documents/Downloads/knetworkled-0.5.1/doc´
<BR>make[3]: Entering directory `/home/nemesi/Documents/Downloads/knetworkled-0.5.1/doc´
<BR>make[3]: Nothing to be done for `install-exec-am´.
<BR>make[3]: Nothing to be done for `install-data-am´.
<BR>make[3]: Leaving directory `/home/nemesi/Documents/Downloads/knetworkled-0.5.1/doc´
<BR>make[2]: Leaving directory `/home/nemesi/Documents/Downloads/knetworkled-0.5.1/doc´
<BR>Making install in en
<BR>make[2]: Entering directory `/home/nemesi/Documents/Downloads/knetworkled-0.5.1/doc/en´
<BR>make[3]: Entering directory `/home/nemesi/Documents/Downloads/knetworkled-0.5.1/doc/en´
<BR>make[3]: Nothing to be done for `install-exec-am´.
<BR>/bin/sh ../../admin/mkinstalldirs /usr/share/doc/HTML/en/knetworkled
<BR>mkdir -p -- /usr/share/doc/HTML/en/knetworkled
<BR>/usr/bin/ginstall -c -p -m 644 index.docbook /usr/share/doc/HTML/en/knetworkled/index.docbook
<BR>/usr/bin/ginstall: preserving times for `/usr/share/doc/HTML/en/knetworkled/index.docbook´: No such file or directory
<BR>/usr/bin/ginstall: cannot set time stamps for `/usr/share/doc/HTML/en/knetworkled/index.docbook´: No such file or directory
<BR>make[3]: *** [install-nls] Error 1
<BR>make[3]: Leaving directory `/home/nemesi/Documents/Downloads/knetworkled-0.5.1/doc/en´
<BR>make[2]: *** [install-am] Error 2
<BR>make[2]: Leaving directory `/home/nemesi/Documents/Downloads/knetworkled-0.5.1/doc/en´
<BR>make[1]: *** [install-recursive] Error 1
<BR>make[1]: Leaving directory `/home/nemesi/Documents/Downloads/knetworkled-0.5.1/doc´
<BR>make: *** [install-recursive] Error 1
<BR>
<BR>**** Installation failed. Aborting package creation. </BLOCKQUOTE></FONT></TD></TR><TR><TD><HR></TD></TR></TABLE><!-- BBCode Quote End -->
<BR>
<BR>Poetete illuminarmi, please? Have a nice day
<BR>
<BR><br>