temi kde - stesso errore di make x tutti: /usr/lib/libexpat.

Se avete problemi con l'installazione e la configurazione di Slackware postate qui. Non usate questo forum per argomenti generali... per quelli usate Gnu/Linux in genere.

Moderatore: Staff

Regole del forum
1) Citare sempre la versione di Slackware usata, la versione del Kernel e magari anche la versione della libreria coinvolta. Questi dati aiutano le persone che possono rispondere.
2) Per evitare confusione prego inserire in questo forum solo topic che riguardano appunto Slackware, se l'argomento è generale usate il forum Gnu/Linux in genere.
3) Leggere attentamente le risposte ricevute.
4) Scrivere i messaggi con il colore di default, evitare altri colori.
5) Scrivere in Italiano o in Inglese, se possibile grammaticalmente corretto, evitate stili di scrittura poco chiari, quindi nessuna abbreviazione tipo telegramma o scrittura stile SMS o CHAT.
6) Appena registrati è consigliato presentarsi nel forum dedicato.

La non osservanza delle regole porta a provvedimenti di vari tipo da parte dello staff, in particolare la non osservanza della regola 5 porta alla cancellazione del post e alla segnalazione dell'utente. In caso di recidività l'utente rischia il ban temporaneo.
Rispondi
Avatar utente
sberla54
Master
Master
Messaggi: 1500
Iscritto il: gio 24 giu 2004, 0:00
Slackware: 13.0
Desktop: Gnome (o Fluxbox)
Distribuzione: Ubuntu
Località: Bologna
Contatta:

temi kde - stesso errore di make x tutti: /usr/lib/libexpat.

Messaggio da sberla54 »

Ciao ragazzi...
<BR>stavo cercando d´installarmi qualche scaricato da kdelooks tema su kde 3.2.3....per la precisione ho provato dotcurve-0.2.1.tar.bz2 e dotcurve-0.2.1.tar.bz2 nonchè 16028-comix-1.1.3.tar.bz2....
<BR>
<BR>Con ./configure tutto a posto....vado a dare make e mi si piantano tutti su questo medesimo punto:
<BR>
<BR>grep: /usr/lib/libexpat.la: No such file or directory
<BR>/usr/bin/sed: can´t read /usr/lib/libexpat.la: No such file or directory
<BR>libtool: link: `/usr/lib/libexpat.la´ is not a valid libtool archive
<BR>make[2]: *** [dotcurve.la] Error 1
<BR>make[2]: Leaving directory `/home/sberla54/dotcurve-0.2.1/dotcurve´
<BR>make[1]: *** [all-recursive] Error 1
<BR>make[1]: Leaving directory `/home/sberla54/dotcurve-0.2.1´
<BR>make: *** [all] Error 2
<BR>
<BR>in effetti non ho nessuno file che si chiami libexpat.la in /usr/lib ma non so neppure se e perchè ci dovrebbe essere...
<BR>
<BR>Qualcuno di voi mi sa dare una mano?
<BR>
<BR>Grazie in anticipo..notte<br>

Avatar utente
useless
Staff
Staff
Messaggi: 3896
Iscritto il: dom 12 ott 2003, 0:00
Località: A place where the streets have no name
Contatta:

temi kde - stesso errore di make x tutti: /usr/lib/libexpat.

Messaggio da useless »

installa il pacchetto expat.<br>

Avatar utente
sberla54
Master
Master
Messaggi: 1500
Iscritto il: gio 24 giu 2004, 0:00
Slackware: 13.0
Desktop: Gnome (o Fluxbox)
Distribuzione: Ubuntu
Località: Bologna
Contatta:

temi kde - stesso errore di make x tutti: /usr/lib/libexpat.

Messaggio da sberla54 »

grazie...ora li compila tutti correttamente anche se alcuni non vanno lo stesso...ma controllero le indicazioni sul kdelooks<br>

Avatar utente
sberla54
Master
Master
Messaggi: 1500
Iscritto il: gio 24 giu 2004, 0:00
Slackware: 13.0
Desktop: Gnome (o Fluxbox)
Distribuzione: Ubuntu
Località: Bologna
Contatta:

temi kde - stesso errore di make x tutti: /usr/lib/libexpat.

Messaggio da sberla54 »

te sei pratico di temi per caso?
<BR>xche l´installazione di un tema è identica alla classica compilazione ed installazione di un sorgente ma qui nada...3/4 dei temi nn li vedo dopo installati....<br>

Avatar utente
useless
Staff
Staff
Messaggi: 3896
Iscritto il: dom 12 ott 2003, 0:00
Località: A place where the streets have no name
Contatta:

temi kde - stesso errore di make x tutti: /usr/lib/libexpat.

Messaggio da useless »

uhm, boh? qualcuno l´ho installato e non ho mai avuto problemi. magari prova:
<BR>./configure --prefix=/opt/kde
<BR>
<BR>e di nuovo make e make install.<br>

Avatar utente
sberla54
Master
Master
Messaggi: 1500
Iscritto il: gio 24 giu 2004, 0:00
Slackware: 13.0
Desktop: Gnome (o Fluxbox)
Distribuzione: Ubuntu
Località: Bologna
Contatta:

temi kde - stesso errore di make x tutti: /usr/lib/libexpat.

Messaggio da sberla54 »

no niente nn mi funzia neanche cosi :(
<BR>eppure la compilazione va a buon fine....<br>

Rispondi